{"text_format":"1","workbook":"xlsx","n_sheets":14,"sheets":["利用申込書1","利用申込書2","利用申込書3","DATA","Sheet3","Sheet1","Sheet2","SU","Sheet4","UD","PG","請求書ひな形","見積書ひな形","Sheet5"],"not_rendered":{"charts":0,"images":0,"macros":1,"external_links":1,"defined_names":128,"comments":1,"pivot_tables":0},"unopened":[],"bounds":{"document_bytes":16777216,"sheet_cells":100000,"rows_first":2000,"rows_last":500,"rows_between":2000,"halvings":0,"cell_chars":16384,"cell_head_chars":4096},"cells_cut":0,"cells_raw":0,"read":"whole","date_system":"1900"}

{"sheet":"利用申込書1","index":0,"n_rows":78,"n_cols":56,"rows_kept":78,"cut":false,"hidden":false,"merged":[[77,49,77,51],[72,49,72,51],[54,49,54,51],[55,49,55,51],[56,49,56,51],[76,49,76,51],[38,17,39,21],[69,49,69,51],[70,49,70,51],[71,49,71,51],[66,49,66,51],[73,49,73,51],[74,49,74,51],[75,49,75,51],[67,49,67,51],[68,49,68,51],[42,27,42,37],[50,38,50,41],[49,39,49,41],[48,37,48,41],[40,27,41,31],[40,32,41,37],[57,49,57,51],[58,49,58,51],[28,32,29,37],[40,38,41,42],[38,22,39,26],[38,27,39,31],[45,33,47,42],[10,65,10,67],[26,22,27,26],[26,27,27,31],[30,27,31,31],[11,29,11,42],[13,10,13,42],[15,33,15,36],[30,5,31,11],[30,12,31,16],[30,17,31,21],[40,22,41,26],[14,5,15,9],[14,10,15,24],[14,25,14,26],[14,29,14,31],[14,38,14,41],[15,25,15,26],[15,29,15,31],[57,61,59,61],[61,49,61,51],[62,49,62,51],[63,49,63,51],[64,49,64,51],[65,49,65,51],[60,49,60,51],[38,32,39,37],[12,25,12,42],[30,38,31,42],[32,38,33,42],[34,38,35,42],[36,38,37,42],[38,38,39,42],[30,32,31,37],[26,38,27,42],[28,38,29,42],[24,20,24,31],[30,22,31,26],[44,11,44,21],[44,22,44,26],[43,27,43,37],[42,38,43,42],[12,18,12,24],[9,29,9,42],[10,31,10,42],[15,38,15,41],[14,33,14,36],[59,49,59,51],[49,0,49,4],[47,5,47,32],[48,6,48,32],[51,25,52,28],[50,25,50,28],[50,29,50,32],[50,17,50,20],[50,21,50,24],[50,11,50,12],[50,13,50,16],[47,0,47,4],[48,0,48,4],[50,7,50,10],[51,7,52,10],[49,29,49,30],[49,5,49,17],[51,29,52,32],[49,31,49,32],[32,32,33,37],[22,0,22,4],[22,20,22,23],[22,24,22,28],[22,30,22,41],[22,13,22,15],[1,4,1,41],[2,24,2,28],[2,29,2,31],[2,33,2,35],[2,38,2,40],[3,29,3,31],[3,33,3,35],[3,38,3,40],[8,0,15,4],[8,5,11,9],[8,10,11,24],[8,25,9,28],[8,29,8,30],[10,25,11,28],[10,29,10,30],[12,5,13,9],[8,31,8,42],[12,11,12,12],[12,14,12,17],[16,0,17,4],[16,5,16,42],[17,5,17,42],[23,0,23,4],[23,5,23,21],[23,22,23,41],[24,0,25,4],[24,5,25,11],[24,32,25,37],[24,38,25,42],[25,12,25,16],[25,17,25,21],[25,22,25,26],[25,27,25,31],[21,0,21,4],[21,10,21,11],[22,17,22,19],[22,8,22,9],[21,25,21,28],[21,29,21,41],[21,12,21,14],[21,7,21,9],[19,0,20,4],[19,5,19,41],[38,0,39,4],[38,5,39,11],[24,12,24,19],[26,5,27,11],[26,12,27,16],[26,17,27,21],[26,32,27,37],[38,12,39,16],[0,0,0,42],[21,16,21,18],[21,19,21,22],[20,5,20,42],[34,0,35,4],[36,0,37,4],[28,0,29,4],[30,0,31,4],[32,5,33,11],[32,12,33,16],[32,17,33,21],[32,22,33,26],[32,27,33,31],[36,17,37,21],[36,22,37,26],[36,27,37,31],[32,0,33,4],[26,0,27,4],[28,5,29,11],[28,12,29,16],[4,41,4,42],[45,0,45,4],[34,32,35,37],[36,5,37,11],[36,12,37,16],[42,22,42,26],[43,22,43,26],[36,32,37,37],[34,5,35,11],[34,12,35,16],[34,17,35,21],[34,22,35,26],[34,27,35,31],[40,5,41,11],[28,17,29,21],[28,22,29,26],[28,27,29,31],[40,0,41,4],[40,12,41,16],[40,17,41,21],[46,0,46,4],[46,5,46,20],[44,0,44,4],[42,0,43,4],[43,7,43,11],[43,13,43,14],[43,16,43,17],[42,7,42,12],[45,12,45,19],[42,13,42,21],[45,21,45,26]]}
["パソコンから利用申し込み書に入力される場合、下記の事項にご留意ください。\n　・滋賀県内、県外識別のためお申込み主催者の郵便番号を入力ください。\n　・ピアザホール、大会議室のご利用の場合、参加費の加算の有無について、該当のグループボックスにチェックを入れてください。\n　・同一利用日、区分の会議室重複申し込みに注意ください。(ピアザホール、大会議室は本番と準備が重ならないよう注意ください。)\n  ・利用申込書は窓口持参、郵送、FAXの他メールでも受け付けしておりますので、入力後添付ファイルでメール送信をも可能です。"]
[null,null,null,null,"■■　滋賀県立県民交流センター利用申込書 ・ （ 利用承認書 ）　■■"]
[null,null,null,null,null,null,null,null,null,null,null,null,null,null,null,null,null,null,null,null,null,null,null,null,"申込日",null,null,null,null,null,null,null,"年",null,null,null,"月",null,null,null,null,"日",null,null,null,null,{"$f":"IF(AT3=\"(一社)A\",\"一般社団法人A\",(IF(AT3=\"㈱A\",\"株式会社A\",\"\")))","v":""}]
[null,null,"滋賀県立県民交流センター",null,null,null,null,null,null,null,null,null,null,"館長　宛",null,null,null,null,null,null,null,null,null,null,null,null,null,null,null,null,null,null,null,null,null,null,null,null,null,null,null,null,null,null,null,{"$f":"AD3&\".\"&AH3&\".\"&AM3","v":".."}]
[null,null,"　　( 指定管理者　 株式会社コンベンションリンケージ)",null,null,null,null,null,null,null,null,null,null,null,null,null,null,null,null,null,null,null,null,null,null,null,null,null,null,null,null,null,null,null,null,null,null,null,null,null,null,null,null,null,null,{"$f":"TODAY()","v":"2024-04-07"},{"$f":"IF(COUNTIF(AT5,\"*(一社)*\"),\"一般社団法人\",\"\")","v":""},{"$f":"SUBSTITUTE(AT5,\"(一社)\",\"一般社団法人\",1)","v":"45389"}]
[null,null,null,null,null,null,null,null,null,null,null,null,null,null,null,null,null,null,null,null,null,null,null,null,null,null,null,null,null,null,null,null,null,null,null,null,null,null,null,null,null,null,null,null,null,null,null,{"$f":"SUBSTITUTE(SUBSTITUTE(AT6,\"(一社)\",\"一般社団法人\"),\"(株)\",\"株式会社\")","v":""}]
[null,null,"　利用に際しては、県条例によるピアザ淡海滋賀県立県民交流センター利用規定並びにこれに基づく指示に従います。",null,null,null,null,null,null,null,null,null,null,null,null,null,null,null,null,null,null,null,null,null,null,null,null,null,null,null,null,null,null,null,null,null,null,null,null,null,"2023年12月25日　更新",null,null,null,null,null,null,{"$f":"SUBSTITUTE(SUBSTITUTE(SUBSTITUTE(SUBSTITUTE(AT7,\"(一社)\",\"一般社団法人\"),\"(株)\",\"株式会社\"),\"(一財)\",\"一般財団法人\"),\"(社福)\",\"社会福祉法人\")","v":""}]
[]
["申　込　者",null,null,null,null,"団体名",null,null,null,null,null,null,null,null,null,null,null,null,null,null,null,null,null,null,null,"代表者",null,null,null,"(カナ)　　　　　　　"]
[null,null,null,null,null,null,null,null,null,null,null,null,null,null,null,null,null,null,null,null,null,null,null,null,null,null,null,null,null,null,null,null,null,null,null,null,null,null,null,null,null,null,null,null,null,{"$f":"K9","v":0},null,{"$f":"SUBSTITUTE(SUBSTITUTE(SUBSTITUTE(SUBSTITUTE(SUBSTITUTE(SUBSTITUTE(SUBSTITUTE(SUBSTITUTE(AT10,\"(一社)\",\"一般社団法人\"),\"(株)\",\"株式会社\"),\"(一財)\",\"一般財団法人\"),\"(社福)\",\"社会福祉法人\"),\"(公社)\",\"公益社団法人\"),\"(公財)\",\"公益財団法人\"),\"(有)\",\"有限会社\"),\"㈱\",\"株式会社\")","v":"0"}]
[null,null,null,null,null,null,null,null,null,null,null,null,null,null,null,null,null,null,null,null,null,null,null,null,null,"会場\n責任者",null,null,null,"(カナ)　　　　　　"]
[]
[null,null,null,null,null,"住所",null,null,null,null,"〒",null,null,"―",null,null,null,null,{"$f":"PG!F1","v":""},null,null,null,null,null,null,"　　　*郵便番号は半角英数字で必ず入力ください。"]
[]
[null,null,null,null,null,"e-mail",null,null,null,null,null,null,null,null,null,null,null,null,null,null,null,null,null,null,null,"Tel",null,null,null,null,null,null,"－",null,null,null,null,"－"]
[null,null,null,null,null,null,null,null,null,null,null,null,null,null,null,null,null,null,null,null,null,null,null,null,null,"Fax",null,null,null,null,null,null,"－",null,null,null,null,"－"]
["主催者依頼事項他",null,null,null,null,"* 申込み者と請求先、領収書宛先などが異なる場合など依頼事項を記載願います。"]
[]
[]
["館内掲示用\n催　事　名",null,null,null,null,"催事名に社名など必要な場合、含めて記入ください。ここに記載の通り掲示いたします。"]
[]
["催事内容",null,null,null,null,null,null,"会議",null,null," 研修",null,"講演",null,null,null,"　展示",null,null,"　発表会",null,null,null,null,null,"その他　(",null,null,null,null,null,null,null,null,null,null,null,null,null,null,null,null,")"]
["本番時間",null,null,null,null,null,null,null,null,null,"：",null,"～",null,null,null,"：",null,null,null,"参加人員",null,null,null,null,null,null,null,null,"名","    限定　　　　　　一般参加"]
["参加費加算",null,null,null,null,null,null,null,null,null,null,null,null,null,null,null,null,null,null,null,null,null,"*　ピアザホール、大会議室のご利用が、対象となります。\n(@1,000以下、3割加算、＠1,001以上　5割加算)"]
["ご利用日\n*次の書式で半角\n　で入力ください。\n 20〇〇/〇〇/〇〇",null,null,null,null,"会 議 室 名",null,null,null,null,null,null,"利　用　区　分",null,null,null,null,null,null,null,"  利用する各区のチェックボックスを\n  クリックください。",null,null,null,null,null,null,null,null,null,null,null,"利用料小計",null,null,null,null,null,"備　　　　考\n(会議室に個別の館内掲示\nが必要な場合、記載ください。)\n凡例：　講師控室,　第2会場など"]
[null,null,null,null,null,null,null,null,null,null,null,null,"早朝開室\n　(8-9時)",null,null,null,null,"午前\n　(9-12時)",null,null,null,null,"午後　\n(13-17時)",null,null,null,null,"夜間\n　(18-21時)"]
[null,null,null,null,null,null,null,null,null,null,null,null,{"$f":"IF(PG!I7=0, \"\", PG!I7)","v":""},null,null,null,null,{"$f":"IF(PG!J7=0, \"\", PG!J7)","v":""},null,null,null,null,{"$f":"IF(PG!K7=0,\"\",(IF(AND(PG!F9=1,PG!F10=1,OR(F27=\"ピアザホール(本番)\", F27=\"ピアザホール(準備)\",F27=\"練習室(一般)\",F27=\"練習室(学生)\")),PG!M7,  PG!K7)))","v":""},null,null,null,null,{"$f":"IF(PG!L7=0,\"\",(IF(AND(PG!F9=1,PG!F10=1,OR(F27=\"ピアザホール(本番)\", F27=\"ピアザホール(準備)\",F27=\"練習室(一般)\",F27=\"練習室(学生)\")),PG!M7, PG!L7)))","v":""},null,null,null,null,{"$f":"IF(SUM(M27:AF28)=0,\"\",SUM(M27:AF28))","v":""},null,null,null,null,null,null,null,null,null,null,null,null,{"$f":"IF(PG!$C$1=2,\"県外5割加算含む\",\"\")","v":""}]
[null,null,null,null,null,null,null,null,null,null,null,null,null,null,null,null,null,null,null,null,null,null,null,null,null,null,null,null,null,null,null,null,null,null,null,null,null,null,null,null,null,null,null,null,null,{"$f":"CHOOSE(PG!$C$2,VLOOLUP(PG!$D$7,DATA!$AK$1:$AN$24,2,FALSE),VLOOKUP(PG!$D$7,DATA!$AK$1:$AN$24,3,FALSE),VLOOKUP(PG!$D$7,DATA!$AK$1:$AN$24,4,))","v":{"$error":"#NAME?"}}]
[null,null,null,null,null,null,null,null,null,null,null,null,{"$f":"IF(PG!I11=0, \"\",PG!I11)","v":""},null,null,null,null,{"$f":"IF(PG!J11=0, \"\", PG!J11)","v":""},null,null,null,null,{"$f":"IF(PG!K11=0,\"\",(IF(AND(PG!F13=1,PG!F14=1,OR(F29=\"ピアザホール(本番)\", F29=\"ピアザホール(準備)\",F29=\"練習室(一般)\",F29=\"練習室(学生)\")),PG!M11, PG!K11)))","v":""},null,null,null,null,{"$f":"IF(PG!L11=0,\"\",(IF(AND(PG!F13=1,PG!F14=1,OR(F29=\"ピアザホール(本番)\", F29=\"ピアザホール(準備)\",F29=\"練習室(一般)\",F29=\"練習室(学生)\")),PG!M11, PG!L11)))","v":""},null,null,null,null,{"$f":"IF(SUM(M29:AF30)=0,\"\",SUM(M29:AF30))","v":""},null,null,null,null,null,null,null,null,null,null,null,null,{"$f":"IF(PG!$C$1=2,\"県外5割加算含む\",\"\")","v":""}]
[null,null,null,null,null,null,null,null,null,null,null,null,null,null,null,null,null,null,null,null,null,null,null,null,null,null,null,null,null,null,null,null,null,null,null,null,null,null,null,null,null,null,null,null,null,{"$f":"CHOOSE(PG!$C$2,VLOOLUP(PG!$D$11,DATA!$AK$1:$AN$24,2,FALSE),VLOOKUP(PG!$D$11,DATA!$AK$1:$AN$24,3,FALSE),VLOOKUP(PG!$D$11,DATA!$AK$1:$AN$24,4,))","v":{"$error":"#NAME?"}}]
[null,null,null,null,null,null,null,null,null,null,null,null,{"$f":"IF(PG!I15=0, \"\", PG!I15)","v":""},null,null,null,null,{"$f":"IF(PG!J15=0, \"\", PG!J15)","v":""},null,null,null,null,{"$f":"IF(PG!K15=0,\"\",(IF(AND(PG!F17=1,PG!F18=1,OR(F31=\"ピアザホール(本番)\", F31=\"ピアザホール(準備)\",F31=\"練習室(一般)\",F31=\"練習室(学生)\")),PG!M15, PG!K15)))","v":""},null,null,null,null,{"$f":"IF(PG!L15=0,\"\",(IF(AND(PG!F17=1,PG!F18=1,OR(F31=\"ピアザホール(本番)\", F31=\"ピアザホール(準備)\",F31=\"練習室(一般)\",F31=\"練習室(学生)\")),PG!M15, PG!L15)))","v":""},null,null,null,null,{"$f":"IF(SUM(M31:AF32)=0,\"\",SUM(M31:AF32))","v":""},null,null,null,null,null,null,null,null,null,null,null,null,{"$f":"IF(PG!$C$1=2,\"県外5割加算含む\",\"\")","v":""}]
[null,null,null,null,null,null,null,null,null,null,null,null,null,null,null,null,null,null,null,null,null,null,null,null,null,null,null,null,null,null,null,null,null,null,null,null,null,null,null,null,null,null,null,null,null,{"$f":"CHOOSE(PG!$C$2,VLOOLUP(PG!$D$15,DATA!$AK$1:$AN$24,2,FALSE),VLOOKUP(PG!$D$15,DATA!$AK$1:$AN$24,3,FALSE),VLOOKUP(PG!$D$15,DATA!$AK$1:$AN$24,4,))","v":{"$error":"#NAME?"}}]
[null,null,null,null,null,null,null,null,null,null,null,null,{"$f":"IF(PG!I19=0, \"\", PG!I19)","v":""},null,null,null,null,{"$f":"IF(PG!J19=0, \"\", PG!J19)","v":""},null,null,null,null,{"$f":"IF(PG!K19=0,\"\",(IF(AND(PG!F21=1,PG!F22=1,OR(F33=\"ピアザホール(本番)\", F33=\"ピアザホール(準備)\",F33=\"練習室(一般)\",F33=\"練習室(学生)\")),PG!M19, PG!K19)))","v":""},null,null,null,null,{"$f":"IF(PG!L19=0,\"\",(IF(AND(PG!F21=1,PG!F22=1,OR(F33=\"ピアザホール(本番)\", F33=\"ピアザホール(準備)\",F33=\"練習室(一般)\",F33=\"練習室(学生)\")),PG!M19, PG!L19)))","v":""},null,null,null,null,{"$f":"IF(SUM(M33:AF34)=0,\"\",SUM(M33:AF34))","v":""},null,null,null,null,null,null,null,null,null,null,null,null,{"$f":"IF(PG!$C$1=2,\"県外5割加算含む\",\"\")","v":""}]
[null,null,null,null,null,null,null,null,null,null,null,null,null,null,null,null,null,null,null,null,null,null,null,null,null,null,null,null,null,null,null,null,null,null,null,null,null,null,null,null,null,null,null,null,null,{"$f":"CHOOSE(PG!$C$2,VLOOLUP(PG!$D$19,DATA!$AK$1:$AN$24,2,FALSE),VLOOKUP(PG!$D$19,DATA!$AK$1:$AN$24,3,FALSE),VLOOKUP(PG!$D$19,DATA!$AK$1:$AN$24,4,))","v":{"$error":"#NAME?"}}]
[null,null,null,null,null,null,null,null,null,null,null,null,{"$f":"IF(PG!I23=0, \"\",PG!I23)","v":""},null,null,null,null,{"$f":"IF(PG!J23=0, \"\", PG!J23)","v":""},null,null,null,null,{"$f":"IF(PG!K23=0,\"\",(IF(AND(PG!F25=1,PG!F26=1,OR(F35=\"ピアザホール(本番)\", F35=\"ピアザホール(準備)\",F35=\"練習室(一般)\",F35=\"練習室(学生)\")),PG!M23, PG!K23)))","v":""},null,null,null,null,{"$f":"IF(PG!L23=0,\"\",(IF(AND(PG!F25=1,PG!F26=1,OR(F35=\"ピアザホール(本番)\", F35=\"ピアザホール(準備)\",F35=\"練習室(一般)\",F35=\"練習室(学生)\")),PG!M23, PG!L23)))","v":""},null,null,null,null,{"$f":"IF(SUM(M35:AF36)=0,\"\",SUM(M35:AF36))","v":""},null,null,null,null,null,null,null,null,null,null,null,null,{"$f":"IF(PG!$C$1=2,\"県外5割加算含む\",\"\")","v":""}]
[null,null,null,null,null,null,null,null,null,null,null,null,null,null,null,null,null,null,null,null,null,null,null,null,null,null,null,null,null,null,null,null,null,null,null,null,null,null,null,null,null,null,null,null,null,{"$f":"CHOOSE(PG!$C$2,VLOOLUP(PG!$D$23,DATA!$AK$1:$AN$24,2,FALSE),VLOOKUP(PG!$D$23,DATA!$AK$1:$AN$24,3,FALSE),VLOOKUP(PG!$D$23,DATA!$AK$1:$AN$24,4,))","v":{"$error":"#NAME?"}}]
[null,null,null,null,null,null,null,null,null,null,null,null,{"$f":"IF(PG!I27=0, \"\", PG!I27)","v":""},null,null,null,null,{"$f":"IF(PG!J27=0, \"\",PG!J27)","v":""},null,null,null,null,{"$f":"IF(PG!K27=0,\"\",(IF(AND(PG!F29=1,PG!F30=1,OR(F37=\"ピアザホール(本番)\", F37=\"ピアザホール(準備)\",F37=\"練習室(一般)\",F37=\"練習室(学生)\")),PG!M27, PG!K27)))","v":""},null,null,null,null,{"$f":"IF(PG!L27=0,\"\",(IF(AND(PG!F29=1,PG!F30=1,OR(F37=\"ピアザホール(本番)\", F37=\"ピアザホール(準備)\",F37=\"練習室(一般)\",F37=\"練習室(学生)\")),PG!M27, PG!L27)))","v":""},null,null,null,null,{"$f":"IF(SUM(M37:AF38)=0,\"\",SUM(M37:AF38))","v":""},null,null,null,null,null,null,null,null,null,null,null,null,{"$f":"IF(PG!$C$1=2,\"県外5割加算含む\",\"\")","v":""}]
[null,null,null,null,null,null,null,null,null,null,null,null,null,null,null,null,null,null,null,null,null,null,null,null,null,null,null,null,null,null,null,null,null,null,null,null,null,null,null,null,null,null,null,null,null,{"$f":"CHOOSE(PG!$C$2,VLOOLUP(PG!$D$27,DATA!$AK$1:$AN$24,2,FALSE),VLOOKUP(PG!$D$27,DATA!$AK$1:$AN$24,3,FALSE),VLOOKUP(PG!$D$27,DATA!$AK$1:$AN$24,4,))","v":{"$error":"#NAME?"}}]
[null,null,null,null,null,null,null,null,null,null,null,null,{"$f":"IF(PG!I31=0, \"\",PG!I31)","v":""},null,null,null,null,{"$f":"IF(PG!J31=0, \"\",PG!J31)","v":""},null,null,null,null,{"$f":"IF(PG!K31=0,\"\",(IF(AND(PG!F33=1,PG!F34=1,OR(F39=\"ピアザホール(本番)\", F39=\"ピアザホール(準備)\",F39=\"練習室(一般)\",F39=\"練習室(学生)\")),PG!M31, PG!K31)))","v":""},null,null,null,null,{"$f":"IF(PG!L31=0,\"\",(IF(AND(PG!F33=1,PG!F34=1,OR(F39=\"ピアザホール(本番)\", F39=\"ピアザホール(準備)\",F39=\"練習室(一般)\",F39=\"練習室(学生)\")),PG!M31, PG!L31)))","v":""},null,null,null,null,{"$f":"IF(SUM(M39:AF40)=0,\"\",SUM(M39:AF40))","v":""},null,null,null,null,null,null,null,null,null,null,null,null,{"$f":"IF(PG!$C$1=2,\"県外5割加算含む\",\"\")","v":""}]
[null,null,null,null,null,null,null,null,null,null,null,null,null,null,null,null,null,null,null,null,null,null,null,null,null,null,null,null,null,null,null,null,null,null,null,null,null,null,null,null,null,null,null,null,null,{"$f":"CHOOSE(PG!$C$2,VLOOLUP(PG!$D$31,DATA!$AK$1:$AN$24,2,FALSE),VLOOKUP(PG!$D$31,DATA!$AK$1:$AN$24,3,FALSE),VLOOKUP(PG!$D$31,DATA!$AK$1:$AN$24,4,))","v":{"$error":"#NAME?"}}]
[null,null,null,null,null,null,null,null,null,null,null,null,{"$f":"IF(PG!I35=0, \"\", PG!I35)","v":""},null,null,null,null,{"$f":"IF(PG!J35=0, \"\", PG!J35)","v":""},null,null,null,null,{"$f":"IF(PG!K35=0,\"\",(IF(AND(PG!F37=1,PG!F38=1,OR(F41=\"ピアザホール(本番)\", F41=\"ピアザホール(準備)\",F41=\"練習室(一般)\",F41=\"練習室(学生)\")),PG!M35, PG!K35)))","v":""},null,null,null,null,{"$f":"IF(PG!L35=0,\"\",(IF(AND(PG!F37=1,PG!F38=1,OR(F41=\"ピアザホール(本番)\", F41=\"ピアザホール(準備)\",F41=\"練習室(一般)\",F41=\"練習室(学生)\")),PG!M35, PG!L35)))","v":""},null,null,null,null,{"$f":"IF(SUM(M41:AF42)=0,\"\",SUM(M41:AF42))","v":""},null,null,null,null,null,null,null,null,null,null,null,null,{"$f":"IF(PG!$C$1=2,\"県外5割加算含む\",\"\")","v":""}]
[null,null,null,null,null,null,null,null,null,null,null,null,null,null,null,null,null,null,null,null,null,null,null,null,null,null,null,null,null,null,null,null,null,null,null,null,null,null,null,null,null,null,null,null,null,{"$f":"CHOOSE(PG!$C$2,VLOOLUP(PG!$D$35,DATA!$AK$1:$AN$24,2,FALSE),VLOOKUP(PG!$D$35,DATA!$AK$1:$AN$24,3,FALSE),VLOOKUP(PG!$D$35,DATA!$AK$1:$AN$24,4,))","v":{"$error":"#NAME?"}}]
["お支払い方法",null,null,null,null,null,null," 当日払い（       ）",null,null,null,null,null,"＊キャッシュレス化\n推進にご協力ください。",null,null,null,null,null,null,null,null,"利用料合計",null,null,null,null,{"$f":"IF(SUM(AG27:AL42)=0,\"\",SUM(AG27:AL42))","v":""},null,null,null,null,null,null,null,null,null,null,"承認印"]
[null,null,null,null,null,null,null,"事前銀行振込",null,null,null,null,"(",null,null,"月",null,null,"日まで）",null,null,null,"利用料総計",null,null,null,null,{"$f":"IF(SUM(AG27:AL42)+利用申込書2!AB56=0,\"\",SUM(AG27:AL42)+利用申込書2!AB56+利用申込書3!AB56)","v":""}]
["付帯設備",null,null,null,null,"   　 不要",null,null,null,"・",null,"要（ 別紙の通り ）",null,null,null,null,null,null,null,null,null,null,"物　販",null,null,null,null,null," 無　 ・",null,null,"有"]
["飲食",null,null,null,null,null,"   無",null,"・","      有",null,null,"(     　手配希望　　",null,null,null,null,null,null,null,null,"持込　)"]
["連絡先の開示",null,null,null,null,"本催事についての問合せには、申込書の連絡先\nをお答えしてもよろしいでしょうか？",null,null,null,null,null,null,null,null,null,null,null,null,null,null,null,null,"(        可　　  　    不可　　)",null,null,null,null,null,null,null,null,null,null,null,null,null,null,null,null,null,null,null,null,null,null,null,null,","]
["開所時間の変更理由",null,null,null,null,null,null,null,null,null,null,null,null,null,null,null,null,null,null,null,null,null,null,null,null,null,null,null,null,null,null,null,null,null,null,null,null,null,null,null,null,null,null,null,null,null,null,{"$f":"CONCATENATE($AV$50,$AV$47,$AV$51,$AV$52,$AV$53)","v":",(0様)"}]
["休所日開室の理由",null,null,null,null,null,null,null,null,null,null,null,null,null,null,null,null,null,null,null,null,null,null,null,null,null,null,null,null,null,null,null,null,null,null,null,null,null,null,null,null,null,null,null,null,null,null,{"$f":"SUBSTITUTE(SUBSTITUTE(SUBSTITUTE(SUBSTITUTE(SUBSTITUTE(SUBSTITUTE(SUBSTITUTE(SUBSTITUTE(SUBSTITUTE(SUBSTITUTE(SUBSTITUTE(SUBSTITUTE(SUBSTITUTE(SUBSTITUTE(K9,\"一般社団法人\",\"\"),\"株式会社\",\"\"),\"一般財団法人\",\"\"),\"社会福祉法人\",\"\"),\"有限会社\",\"\"),\"㈱\",\"\"),\"(一社)\",\"\"),\"(一財)\",\"\"),\"公益財団法人\",\"\"),\"公益社団法人\",\"\"),\"(有)\",\"\"),\"(社福)\",\"\"),\"(公社)\",\"\"),\"(公財)\",\"\")","v":""}]
["ｾﾝﾀｰ処理欄",null,null,null,null,null,null,null,null,null,null,null,null,null,null,null,null,null,null,null,null,null,null,null,null,null,null,null,null,null,null,null,null,null,null,null,null,null,null,null,null,null,null,null,null,null,null,{"$f":"SUBSTITUTE(SUBSTITUTE(SUBSTITUTE(SUBSTITUTE(SUBSTITUTE(SUBSTITUTE(SUBSTITUTE(SUBSTITUTE(SUBSTITUTE(SUBSTITUTE(SUBSTITUTE(SUBSTITUTE(SUBSTITUTE(SUBSTITUTE(K9,\"一般社団法人\",\"(一社)\"),\"株式会社\",\"㈱\"),\"一般財団法人\",\"(一財)\"),\"社会福祉法人\",\"(社福)\"),\"有限会社\",\"(有)\"),\"㈱\",\"㈱\"),\"(一社)\",\"(一社)\"),\"(一財)\",\"(一財)\"),\"公益財団法人\",\"(公社)\"),\"公益社団法人\",\"(公社)\"),\"(有)\",\"(有)\"),\"(社福)\",\"(社福)\"),\"(公社)\",\"(公社)\"),\"(公財)\",\"(公財)\")","v":""},null,null,null,null,null,null,null,{"$f":"SUBSTITUTE(SUBSTITUTE(SUBSTITUTE(SUBSTITUTE(K14,\"滋賀県\",\"\"),\"犬上郡\",\"\"),\"愛知郡\",\"\"),\"蒲生郡\",\"\")","v":""}]
[null,null,null,null,null,null,null,null,null,null,null,null,null,null,null,null,null,"受付",null,null,null,"台帳記入",null,null,null,"所在",null,null,null,"種別",null,null,null,null,null,null,null,null,null,null,null,null,null,null,null,null,null,"(",null,null,null,null,null,null,null,{"$f":"IF(MID(BD50,4,1)=\"県\",LEFT(BD50,4),LEFT(BD50,3))","v":""}]
[null,null,null,null,"    ",null,null,null,null,null,null,null,null,null,null,null,null,null,null,null,null,null,null,null,null,{"$f":"BD52","v":""},null,null,null,{"$f":"IFERROR(VLOOKUP(K9,[1]Sheet1!$D$5:$E$3000,2,FALSE),\"\")","v":"nf"},null,null,null,"上記の通り利用を承認します。",null,null,null,null,null,null,null,null,null,null,null,null,null,{"$f":"AD12","v":0},"同上",null,null,null,null,null,null,{"$f":"SUBSTITUTE(SUBSTITUTE(SUBSTITUTE(BD51,\"近江八\",\"近江八幡市\"),\"大阪市\",\"大阪府\"),\"京都市\",\"京都府\")","v":""}]
[null,null,null,null,null,null,null,null,null,null,null,null,null,null,null,null,null,null,null,null,null,null,null,null,null,null,null,null,null,null,null,null,null,"印のないものは無効です。",null,null,null,null,null,null,null,null,null,null,null,null,null,"様)"]
[]
[null,"*やむを得ない理由で、会議室の開所時間の変更、休館日の開室を希望される場合は県条例に基づき館長の特別承認が必要と",null,null,null,null,null,null,null,null,null,null,null,null,null,null,null,null,null,null,null,null,null,null,null,null,null,null,null,null,null,null,null,null,null,null,null,null,null,null,null,null,"Rev.6",null,null,{"$f":"A27","v":"00:00:00"},{"$f":"IF(OR(F27<=207,N27=\"ピアザホール(準備)\",N27=\"ピアザホール(本番)\"),\"2階\",IF(OR(N27=\"練習室(一般)\",N27=\"練習室(学生)\"),\"1階\",\"3階\"))","v":"2階"},{"$f":"PG!$D$7","v":0},{"$f":"$F$21","v":0}]
[null,"　なりますので、その理由を利用申込書の記載欄に記載ください。　",null,null,null,null,null,null,null,null,null,null,null,null,null,null,null,null,null,null,null,null,null,null,null,null,null,null,null,null,null,null,null,null,null,null,null,null,null,null,null,null,null,null,null,{"$f":"A27","v":"00:00:00"},null,null,{"$f":"CONCATENATE($AV$50,$AV$51,$AV$52,$AV$53)","v":"(0様)"}]
[null,"*本申込書に記載された個人に関わる情報につきましては、当施設利用に関する目的以外に使用しません。",null,null,null,null,null,null,null,null,null,null,null,null,null,null,null,null,null,null,null,null,null,null,null,null,null,null,null,null,null,null,null,null,null,null,null,null,null,null,null,null,null,null,null,{"$f":"A27","v":"00:00:00"},null,{"$f":"$Y$23","v":0},{"$f":"PG!$H$1","v":"：～："}]
[null,"*利用承認書は、基本、記載の申込者住所へ郵送いたします。",null,null,null,null,null,null,null,null,null,null,null,null,null,null,null,null,null,null,null,null,null,null,null,null,null,null,null,null,null,null,null,null,null,null,null,null,null,null,null,null,null,null,null,{"$f":"IF(A29=\"\",AT55,A29)","v":"00:00:00"},{"$f":"IF(OR(F29<=207,N29=\"ピアザホール(準備)\",N29=\"ピアザホール(本番)\"),\"2階\",IF(OR(N29=\"練習室(一般)\",N29=\"練習室(学生)\"),\"1階\",\"3階\"))","v":"2階"},{"$f":"IF(AND(PG!$D$11=PG!$D$7,PG!$B$11=PG!$B$7),\"\",$F$29)","v":""},{"$f":"$F$21","v":0}]
[null,null,null,null,"　",null,null,null,null,null,null,null,null,null,null,null,null,null,null,null,null,null,null,null,null,null,null,null,null,null,null,null,null,null,null,null,null,null,null,null,null,null,null,null,null,{"$f":"IF(A29=\"\",AT55,A29)","v":"00:00:00"},null,null,{"$f":"CONCATENATE($AV$50,$AV$51,$AV$52,$AV$53)","v":"(0様)"}]
[null,null,null,null,null,null,null,null,null,null,null,null,null,null,null,null,null,null,null,null,null,null,null,null,null,null,null,null,null,null,null,null,null,null,null,null,null,null,null,null,null,null,null,null,null,{"$f":"IF(A29=\"\",AT55,A29)","v":"00:00:00"},null,{"$f":"$Y$23","v":0},{"$f":"PG!$H$1","v":"：～："}]
[null,null,null,null,null,null,null,null,null,null,null,null,null,null,null,null,null,null,null,null,null,null,null,null,null,null,null,null,null,null,null,null,null,null,null,null,null,null,null,null,null,null,null,null,null,{"$f":"IF(A31=\"\",AT58,A31)","v":"00:00:00"},{"$f":"IF(OR(F31<=207,N31=\"ピアザホール(準備)\",N31=\"ピアザホール(本番)\"),\"2階\",IF(OR(N31=\"練習室(一般)\",N31=\"練習室(学生)\"),\"1階\",\"3階\"))","v":"2階"},{"$f":"IF(AND(PG!$D$15=PG!$D$11,PG!$B$15=PG!$B$11),\"\",$F$31)","v":""},{"$f":"$F$21","v":0}]
[null,null,null,null,null,null,null,null,null,null,null,null,null,null,null,null,null,null,null,null,null,null,null,null,null,null,null,null,null,null,null,null,null,null,null,null,null,null,null,null,null,null,null,null,null,{"$f":"IF(A31=\"\",AT58,A31)","v":"00:00:00"},null,null,{"$f":"CONCATENATE($AV$50,$AV$51,$AV$52,$AV$53)","v":"(0様)"}]
[null,null,null,null,null,null,null,null,null,null,null,null,null,null,null,null,null,null,null,null,null,null,null,null,null,null,null,null,null,null,null,null,null,null,null,null,null,null,null,null,null,null,null,null,null,{"$f":"IF(A31=\"\",AT58,A31)","v":"00:00:00"},null,{"$f":"$Y$23","v":0},{"$f":"PG!$H$1","v":"：～："}]
[null,null,null,null,null,null,null,null,null,null,null,null,null,null,null,null,null,null,null,null,null,null,null,null,null,null,null,null,null,null,null,null,null,null,null,null,null,null,null,null,null,null,null,null,null,{"$f":"IF(A33=\"\",AT61,A33)","v":"00:00:00"},{"$f":"IF(OR(F33<=207,N33=\"ピアザホール(準備)\",N33=\"ピアザホール(本番)\"),\"2階\",IF(OR(N33=\"練習室(一般)\",N33=\"練習室(学生)\"),\"1階\",\"3階\"))","v":"2階"},{"$f":"IF(AND(PG!$D$19=PG!$D$15,PG!$B$19=PG!$B$15),\"\",$F$33)","v":""},{"$f":"$F$21","v":0}]
[null,null,null,null,null,null,null,null,null,null,null,null,null,null,null,null,null,null,null,null,null,null,null,null,null,null,null,null,null,null,null,null,null,null,null,null,null,null,null,null,null,null,null,null,null,{"$f":"IF(A33=\"\",AT61,A33)","v":"00:00:00"},null,null,{"$f":"CONCATENATE($AV$50,$AV$51,$AV$52,$AV$53)","v":"(0様)"}]
[null,null,null,null,null,null,null,null,null,null,null,null,null,null,null,null,null,null,null,null,null,null,null,null,null,null,null,null,null,null,null,null,null,null,null,null,null,null,null,null,null,null,null,null,null,{"$f":"IF(A33=\"\",AT61,A33)","v":"00:00:00"},null,{"$f":"$Y$23","v":0},{"$f":"PG!$H$1","v":"：～："}]
[null,null,null,null,null,null,null,null,null,null,null,null,null,null,null,null,null,null,null,null,null,null,null,null,null,null,null,null,null,null,null,null,null,null,null,null,null,null,null,null,null,null,null,null,null,{"$f":"IF(A35=\"\",AT64,A35)","v":"00:00:00"},{"$f":"IF(OR(F35<=207,N35=\"ピアザホール(準備)\",N35=\"ピアザホール(本番)\"),\"2階\",IF(OR(N35=\"練習室(一般)\",N35=\"練習室(学生)\"),\"1階\",\"3階\"))","v":"2階"},{"$f":"IF(AND(PG!$D$23=PG!$D$19,PG!$B$23=PG!$B$19),\"\",$F$35)","v":""},{"$f":"$F$21","v":0}]
[null,null,null,null,null,null,null,null,null,null,null,null,null,null,null,null,null,null,null,null,null,null,null,null,null,null,null,null,null,null,null,null,null,null,null,null,null,null,null,null,null,null,null,null,null,{"$f":"IF(A35=\"\",AT64,A35)","v":"00:00:00"},null,null,{"$f":"CONCATENATE($AV$50,$AV$51,$AV$52,$AV$53)","v":"(0様)"}]
[null,null,null,null,null,null,null,null,null,null,null,null,null,null,null,null,null,null,null,null,null,null,null,null,null,null,null,null,null,null,null,null,null,null,null,null,null,null,null,null,null,null,null,null,null,{"$f":"IF(A35=\"\",AT64,A35)","v":"00:00:00"},null,{"$f":"$Y$23","v":0},{"$f":"PG!$H$1","v":"：～："}]
[null,null,null,null,null,null,null,null,null,null,null,null,null,null,null,null,null,null,null,null,null,null,null,null,null,null,null,null,null,null,null,null,null,null,null,null,null,null,null,null,null,null,null,null,null,{"$f":"IF(A37=\"\",AT67,A37)","v":"00:00:00"},{"$f":"IF(OR(F37<=207,N37=\"ピアザホール(準備)\",N37=\"ピアザホール(本番)\"),\"2階\",IF(OR(N37=\"練習室(一般)\",N37=\"練習室(学生)\"),\"1階\",\"3階\"))","v":"2階"},{"$f":"IF(AND(PG!$D$27=PG!$D$23,PG!$B$27=PG!$B$23),\"\",$F$37)","v":""},{"$f":"$F$21","v":0}]
[null,null,null,null,null,null,null,null,null,null,null,null,null,null,null,null,null,null,null,null,null,null,null,null,null,null,null,null,null,null,null,null,null,null,null,null,null,null,null,null,null,null,null,null,null,{"$f":"IF(A37=\"\",AT67,A37)","v":"00:00:00"},null,null,{"$f":"CONCATENATE($AV$50,$AV$51,$AV$52,$AV$53)","v":"(0様)"}]
[null,null,null,null,null,null,null,null,null,null,null,null,null,null,null,null,null,null,null,null,null,null,null,null,null,null,null,null,null,null,null,null,null,null,null,null,null,null,null,null,null,null,null,null,null,{"$f":"IF(A37=\"\",AT67,A37)","v":"00:00:00"},null,{"$f":"$Y$23","v":0},{"$f":"PG!$H$1","v":"：～："}]
[null,null,null,null,null,null,null,null,null,null,null,null,null,null,null,null,null,null,null,null,null,null,null,null,null,null,null,null,null,null,null,null,null,null,null,null,null,null,null,null,null,null,null,null,null,{"$f":"IF(A39=\"\",AT70,A39)","v":"00:00:00"},{"$f":"IF(OR(F39<=207,N39=\"ピアザホール(準備)\",N39=\"ピアザホール(本番)\"),\"2階\",IF(OR(N39=\"練習室(一般)\",N39=\"練習室(学生)\"),\"1階\",\"3階\"))","v":"2階"},{"$f":"IF(AND(PG!$D$31=PG!$D$27,PG!$B$31=PG!$B$27),\"\",$F$39)","v":""},{"$f":"$F$21","v":0}]
[null,null,null,null,null,null,null,null,null,null,null,null,null,null,null,null,null,null,null,null,null,null,null,null,null,null,null,null,null,null,null,null,null,null,null,null,null,null,null,null,null,null,null,null,null,{"$f":"IF(A39=\"\",AT70,A39)","v":"00:00:00"},null,null,{"$f":"CONCATENATE($AV$50,$AV$51,$AV$52,$AV$53)","v":"(0様)"}]
[null,null,null,null,null,null,null,null,null,null,null,null,null,null,null,null,null,null,null,null,null,null,null,null,null,null,null,null,null,null,null,null,null,null,null,null,null,null,null,null,null,null,null,null,null,{"$f":"IF(A39=\"\",AT67,A39)","v":"00:00:00"},null,{"$f":"$Y$23","v":0},{"$f":"PG!$H$1","v":"：～："}]
[null,null,null,null,null,null,null,null,null,null,null,null,null,null,null,null,null,null,null,null,null,null,null,null,null,null,null,null,null,null,null,null,null,null,null,null,null,null,null,null,null,null,null,null,null,{"$f":"IF(A41=\"\",AT72,A41)","v":"00:00:00"},{"$f":"IF(OR(F41<=207,N41=\"ピアザホール(準備)\",N41=\"ピアザホール(本番)\"),\"2階\",IF(OR(N41=\"練習室(一般)\",N41=\"練習室(学生)\"),\"1階\",\"3階\"))","v":"2階"},{"$f":"IF(AND(PG!$D$35=PG!$D$31,PG!$B$35=PG!$B$31),\"\",$F$41)","v":""},{"$f":"$F$21","v":0}]
[null,null,null,null,null,null,null,null,null,null,null,null,null,null,null,null,null,null,null,null,null,null,null,null,null,null,null,null,null,null,null,null,null,null,null,null,null,null,null,null,null,null,null,null,null,{"$f":"IF(A41=\"\",AT72,A41)","v":"00:00:00"},null,null,{"$f":"CONCATENATE($AV$50,$AV$51,$AV$52,$AV$53)","v":"(0様)"}]
[null,null,null,null,null,null,null,null,null,null,null,null,null,null,null,null,null,null,null,null,null,null,null,null,null,null,null,null,null,null,null,null,null,null,null,null,null,null,null,null,null,null,null,null,null,{"$f":"IF(A41=\"\",AT72,A41)","v":"00:00:00"},null,{"$f":"$Y$23","v":0},{"$f":"PG!$H$1","v":"：～："}]

{"sheet":"利用申込書2","index":1,"n_rows":71,"n_cols":48,"rows_kept":71,"cut":false,"hidden":false,"merged":[[62,21,62,23],[62,24,62,26],[57,0,61,4],[55,27,56,37],[55,38,56,42],[55,5,56,26],[9,0,10,4],[9,5,10,11],[9,12,10,16],[9,17,10,21],[9,22,10,26],[9,27,10,31],[9,32,10,37],[11,0,12,4],[11,5,12,11],[11,12,12,16],[11,17,12,21],[11,22,12,26],[11,27,12,31],[11,32,12,37],[13,0,14,4],[13,5,14,11],[13,12,14,16],[13,17,14,21],[0,5,0,41],[1,24,1,28],[4,5,5,41],[7,0,8,4],[7,5,8,11],[7,19,7,31],[7,32,8,37],[7,38,8,42],[8,12,8,16],[8,17,8,21],[8,22,8,26],[8,27,8,31],[2,36,2,37],[2,28,2,31],[2,32,2,33],[2,34,2,35],[2,38,2,40],[13,22,14,26],[13,27,14,31],[13,32,14,37],[15,0,16,4],[15,5,16,11],[15,12,16,16],[15,17,16,21],[15,22,16,26],[15,27,16,31],[15,32,16,37],[21,38,22,42],[21,43,22,46],[23,38,24,42],[23,43,24,46],[17,0,18,4],[17,5,18,11],[17,12,18,16],[17,17,18,21],[17,22,18,26],[17,27,18,31],[17,32,18,37],[19,0,20,4],[19,5,20,11],[19,12,20,16],[19,17,20,21],[19,22,20,26],[19,27,20,31],[19,32,20,37],[19,38,20,42],[19,43,20,46],[21,0,22,4],[21,5,22,11],[21,12,22,16],[21,17,22,21],[21,22,22,26],[21,27,22,31],[21,32,22,37],[23,0,24,4],[23,5,24,11],[23,12,24,16],[23,17,24,21],[23,22,24,26],[23,27,24,31],[23,32,24,37],[29,38,30,42],[29,43,30,46],[31,38,32,42],[31,43,32,46],[25,0,26,4],[25,5,26,11],[25,12,26,16],[25,17,26,21],[25,22,26,26],[25,27,26,31],[25,32,26,37],[27,0,28,4],[27,5,28,11],[27,12,28,16],[27,17,28,21],[27,22,28,26],[27,27,28,31],[27,32,28,37],[25,38,26,42],[25,43,26,46],[27,38,28,42],[27,43,28,46],[29,0,30,4],[29,5,30,11],[29,12,30,16],[29,17,30,21],[29,22,30,26],[29,27,30,31],[29,32,30,37],[31,0,32,4],[31,5,32,11],[31,12,32,16],[31,17,32,21],[31,22,32,26],[31,27,32,31],[31,32,32,37],[37,38,38,42],[37,43,38,46],[39,38,40,42],[39,43,40,46],[33,0,34,4],[33,5,34,11],[33,12,34,16],[33,17,34,21],[33,22,34,26],[33,27,34,31],[33,32,34,37],[35,0,36,4],[35,5,36,11],[35,12,36,16],[35,17,36,21],[35,22,36,26],[35,27,36,31],[35,32,36,37],[33,38,34,42],[33,43,34,46],[35,38,36,42],[35,43,36,46],[37,0,38,4],[37,5,38,11],[43,0,44,4],[43,5,44,11],[43,12,44,16],[43,17,44,21],[43,22,44,26],[43,27,44,31],[43,32,44,37],[37,12,38,16],[37,17,38,21],[37,22,38,26],[37,27,38,31],[37,32,38,37],[39,0,40,4],[39,5,40,11],[39,12,40,16],[39,17,40,21],[39,22,40,26],[39,27,40,31],[39,32,40,37],[51,43,52,46],[53,38,54,42],[53,43,54,46],[45,0,46,4],[45,5,46,11],[45,12,46,16],[45,17,46,21],[45,22,46,26],[45,27,46,31],[45,32,46,37],[47,0,48,4],[47,5,48,11],[47,12,48,16],[47,17,48,21],[47,22,48,26],[47,27,48,31],[47,32,48,37],[53,0,54,4],[53,5,54,11],[53,12,54,16],[53,17,54,21],[53,22,54,26],[53,27,54,31],[51,0,52,4],[53,32,54,37],[49,0,50,4],[49,5,50,11],[49,12,50,16],[49,17,50,21],[49,22,50,26],[49,27,50,31],[49,32,50,37],[9,38,10,42],[41,38,42,42],[51,38,52,42],[41,0,42,4],[41,5,42,11],[41,12,42,16],[41,17,42,21],[41,22,42,26],[41,27,42,31],[41,32,42,37],[51,5,52,11],[51,12,52,16],[51,17,52,21],[51,22,52,26],[51,27,52,31],[51,32,52,37],[9,43,10,46],[11,38,12,42],[11,43,12,46],[13,38,14,42],[13,43,14,46],[15,38,16,42],[15,43,16,46],[17,38,18,42],[17,43,18,46],[41,43,42,46],[43,38,44,42],[43,43,44,46],[45,38,46,42],[45,43,46,46],[47,38,48,42],[47,43,48,46],[49,38,50,42],[49,43,50,46]]}
[]
[null,"<<<<",null,"　続き用1　>>>>"]
[null,null,null,null,"滋賀県立県民交流センター",null,null,null,null,null,null,null,null,null,null,null,null,null,null,null,null,null,null,null,null,null,"申込日",null,null,null,null,null,"年",null,null,null,"月",null,null,null,null,"日"]
[null,null,null,null,"　　( 指定管理者　 株式会社コンベンションリンケージ)"]
[]
[null,null,null,null,"　　利用に際しては、県条例によるピアザ淡海滋賀県立県民交流センター利用規定並びにこれに基づく指示に従います。"]
[]
["ご利用日\n*次の書式で半角\n　で入力ください。\n 20〇〇/〇〇/〇〇",null,null,null,null,"会 議 室 名",null,null,null,null,null,null,null,"利　用　区　分",null,null,null,null,null,"利用する各区のチェックボックスをクリック\nください。",null,null,null,null,null,null,null,null,null,null,null,null,"利用料小計",null,null,null,null,null,"備　　　　考"]
[null,null,null,null,null,null,null,null,null,null,null,null,"早朝開室\n　(8-9時)",null,null,null,null,"午前\n　(9-12時)",null,null,null,null,"午後　\n(13-17時)",null,null,null,null,"夜間\n　(18-21時)"]
[null,null,null,null,null,null,null,null,null,null,null,null,{"$f":"IF(PG!I39=0, \"\", PG!I39)","v":""},null,null,null,null,{"$f":"IF(PG!J39=0, \"\", PG!J39)","v":""},null,null,null,null,{"$f":"IF(PG!K39=0,\"\",(IF(AND(PG!F41=1,PG!F42=1,OR(F10=\"ピアザホール(本番)\", F10=\"ピアザホール(準備)\",F10=\"練習室(一般)\",F10=\"練習室(学生)\")),PG!M39, PG!K39)))","v":""},null,null,null,null,{"$f":"IF(PG!L39=0,\"\",(IF(AND(PG!F41=1,PG!F42=1,OR(F10=\"ピアザホール(本番)\", F10=\"ピアザホール(準備)\",F10=\"練習室(一般)\",F10=\"練習室(学生)\")),PG!M39, PG!L39)))","v":""},null,null,null,null,{"$f":"IF(SUM(M10:AF11)=0,\"\",SUM(M10:AF11))","v":""}]
[]
[null,null,null,null,null,null,null,null,null,null,null,null,{"$f":"IF(PG!I43=0, \"\", PG!I43)","v":""},null,null,null,null,{"$f":"IF(PG!J43=0, \"\", PG!J43)","v":""},null,null,null,null,{"$f":"IF(PG!K43=0,\"\",(IF(AND(PG!F45=1,PG!F46=1,OR(F12=\"ピアザホール(本番)\", F12=\"ピアザホール(準備)\",F12=\"練習室(一般)\",F12=\"練習室(学生)\")),PG!M43, PG!K43)))","v":""},null,null,null,null,{"$f":"IF(PG!L43=0,\"\",(IF(AND(PG!F45=1,PG!F46=1,OR(F12=\"ピアザホール(本番)\", F12=\"ピアザホール(準備)\",F12=\"練習室(一般)\",F12=\"練習室(学生)\")),PG!M43, PG!L43)))","v":""},null,null,null,null,{"$f":"IF(SUM(M12:AF13)=0,\"\",SUM(M12:AF13))","v":""}]
[]
[null,null,null,null,null,null,null,null,null,null,null,null,{"$f":"IF(PG!I47=0, \"\", PG!I47)","v":""},null,null,null,null,{"$f":"IF(PG!J47=0, \"\", PG!J47)","v":""},null,null,null,null,{"$f":"IF(PG!K47=0,\"\",(IF(AND(PG!F49=1,PG!F50=1,OR(F14=\"ピアザホール(本番)\", F14=\"ピアザホール(準備)\",F14=\"練習室(一般)\",F14=\"練習室(学生)\")),PG!M47, PG!K47)))","v":""},null,null,null,null,{"$f":"IF(PG!L47=0,\"\",(IF(AND(PG!F49=1,PG!F50=1,OR(F14=\"ピアザホール(本番)\", F14=\"ピアザホール(準備)\",F14=\"練習室(一般)\",F14=\"練習室(学生)\")),PG!M47, PG!L47)))","v":""},null,null,null,null,{"$f":"IF(SUM(M14:AF15)=0,\"\",SUM(M14:AF15))","v":""}]
[]
[null,null,null,null,null,null,null,null,null,null,null,null,{"$f":"IF(PG!I51=0, \"\", PG!I51)","v":""},null,null,null,null,{"$f":"IF(PG!J51=0, \"\", PG!J51)","v":""},null,null,null,null,{"$f":"IF(PG!K51=0,\"\",(IF(AND(PG!F53=1,PG!F54=1,OR(F16=\"ピアザホール(本番)\", F16=\"ピアザホール(準備)\",F16=\"練習室(一般)\",F16=\"練習室(学生)\")),PG!M51, PG!K51)))","v":""},null,null,null,null,{"$f":"IF(PG!L51=0,\"\",(IF(AND(PG!F53=1,PG!F54=1,OR(F16=\"ピアザホール(本番)\", F16=\"ピアザホール(準備)\",F16=\"練習室(一般)\",F16=\"練習室(学生)\")),PG!M51, PG!L51)))","v":""},null,null,null,null,{"$f":"IF(SUM(M16:AF17)=0,\"\",SUM(M16:AF17))","v":""}]
[]
[null,null,null,null,null,null,null,null,null,null,null,null,{"$f":"IF(PG!I55=0, \"\", PG!I55)","v":""},null,null,null,null,{"$f":"IF(PG!J55=0, \"\", PG!J55)","v":""},null,null,null,null,{"$f":"IF(PG!K55=0,\"\",(IF(AND(PG!F57=1,PG!F58=1,OR(F18=\"ピアザホール(本番)\", F18=\"ピアザホール(準備)\",F18=\"練習室(一般)\",F18=\"練習室(学生)\")),PG!M55, PG!K55)))","v":""},null,null,null,null,{"$f":"IF(PG!L55=0,\"\",(IF(AND(PG!F57=1,PG!F58=1,OR(F18=\"ピアザホール(本番)\", F18=\"ピアザホール(準備)\",F18=\"練習室(一般)\",F18=\"練習室(学生)\")),PG!M55, PG!L55)))","v":""},null,null,null,null,{"$f":"IF(SUM(M18:AF19)=0,\"\",SUM(M18:AF19))","v":""},null,null,null,null,null,null,null,null,null,null,null,null,null,null,{"$f":"TEXT(AU66,\"??????\")","v":{"$error":"#REF!"}}]
[null,null,null,null,null,null,null,null,null,null,null,null,null,null,null,null,null,null,null,null,null,null,null,null,null,null,null,null,null,null,null,null,null,null,null,null,null,null,null,null,null,null,null,null,null,null,null,{"$error":"#REF!"}]
[null,null,null,null,null,null,null,null,null,null,null,null,{"$f":"IF(PG!I59=0, \"\", PG!I59)","v":""},null,null,null,null,{"$f":"IF(PG!J59=0, \"\", PG!J59)","v":""},null,null,null,null,{"$f":"IF(PG!K59=0,\"\",(IF(AND(PG!F61=1,PG!F62=1,OR(F20=\"ピアザホール(本番)\", F20=\"ピアザホール(準備)\",F20=\"練習室(一般)\",F20=\"練習室(学生)\")),PG!M59, PG!K59)))","v":""},null,null,null,null,{"$f":"IF(PG!L59=0,\"\",(IF(AND(PG!F61=1,PG!F62=1,OR(F20=\"ピアザホール(本番)\", F20=\"ピアザホール(準備)\",F20=\"練習室(一般)\",F20=\"練習室(学生)\")),PG!M59, PG!L59)))","v":""},null,null,null,null,{"$f":"IF(SUM(M20:AF21)=0,\"\",SUM(M20:AF21))","v":""},null,null,null,null,null,null,null,null,null,null,null,null,null,null,{"$error":"#REF!"}]
[null,null,null,null,null,null,null,null,null,null,null,null,null,null,null,null,null,null,null,null,null,null,null,null,null,null,null,null,null,null,null,null,null,null,null,null,null,null,null,null,null,null,null,null,null,null,null,{"$error":"#REF!"}]
[null,null,null,null,null,null,null,null,null,null,null,null,{"$f":"IF(PG!I63=0, \"\", PG!I63)","v":""},null,null,null,null,{"$f":"IF(PG!J63=0, \"\", PG!J63)","v":""},null,null,null,null,{"$f":"IF(PG!K63=0,\"\",(IF(AND(PG!F65=1,PG!F66=1,OR(F22=\"ピアザホール(本番)\", F22=\"ピアザホール(準備)\",F22=\"練習室(一般)\",F22=\"練習室(学生)\")),PG!M63, PG!K63)))","v":""},null,null,null,null,{"$f":"IF(PG!L63=0,\"\",(IF(AND(PG!F65=1,PG!F66=1,OR(F22=\"ピアザホール(本番)\", F22=\"ピアザホール(準備)\",F22=\"練習室(一般)\",F22=\"練習室(学生)\")),PG!M63, PG!L63)))","v":""},null,null,null,null,{"$f":"IF(SUM(M22:AF23)=0,\"\",SUM(M22:AF23))","v":""},null,null,null,null,null,null,null,null,null,null,null,null,null,null,{"$error":"#REF!"}]
[null,null,null,null,null,null,null,null,null,null,null,null,null,null,null,null,null,null,null,null,null,null,null,null,null,null,null,null,null,null,null,null,null,null,null,null,null,null,null,null,null,null,null,null,null,null,null,{"$error":"#REF!"}]
[null,null,null,null,null,null,null,null,null,null,null,null,{"$f":"IF(PG!I67=0, \"\", PG!I67)","v":""},null,null,null,null,{"$f":"IF(PG!J67=0, \"\", PG!J67)","v":""},null,null,null,null,{"$f":"IF(PG!K67=0,\"\",(IF(AND(PG!F69=1,PG!F70=1,OR(F24=\"ピアザホール(本番)\", F24=\"ピアザホール(準備)\",F24=\"練習室(一般)\",F24=\"練習室(学生)\")),PG!M67, PG!K67)))","v":""},null,null,null,null,{"$f":"IF(PG!L67=0,\"\",(IF(AND(PG!F69=1,PG!F70=1,OR(F24=\"ピアザホール(本番)\", F24=\"ピアザホール(準備)\",F24=\"練習室(一般)\",F24=\"練習室(学生)\")),PG!M67, PG!L67)))","v":""},null,null,null,null,{"$f":"IF(SUM(M24:AF25)=0,\"\",SUM(M24:AF25))","v":""}]
[]
[null,null,null,null,null,null,null,null,null,null,null,null,{"$f":"IF(PG!I71=0, \"\", PG!I71)","v":""},null,null,null,null,{"$f":"IF(PG!J71=0, \"\", PG!J71)","v":""},null,null,null,null,{"$f":"IF(PG!K71=0,\"\",(IF(AND(PG!F73=1,PG!F74=1,OR(F26=\"ピアザホール(本番)\", F26=\"ピアザホール(準備)\",F26=\"練習室(一般)\",F26=\"練習室(学生)\")),PG!M71, PG!K71)))","v":""},null,null,null,null,{"$f":"IF(PG!L71=0,\"\",(IF(AND(PG!F73=1,PG!F74=1,OR(F26=\"ピアザホール(本番)\", F26=\"ピアザホール(準備)\",F26=\"練習室(一般)\",F26=\"練習室(学生)\")),PG!M71, PG!L71)))","v":""},null,null,null,null,{"$f":"IF(SUM(M26:AF27)=0,\"\",SUM(M26:AF27))","v":""}]
[]
[null,null,null,null,null,null,null,null,null,null,null,null,{"$f":"IF(PG!I75=0, \"\", PG!I75)","v":""},null,null,null,null,{"$f":"IF(PG!J75=0, \"\", PG!J75)","v":""},null,null,null,null,{"$f":"IF(PG!K75=0,\"\",(IF(AND(PG!F77=1,PG!F78=1,OR(F28=\"ピアザホール(本番)\", F28=\"ピアザホール(準備)\",F28=\"練習室(一般)\",F28=\"練習室(学生)\")),PG!M75, PG!K75)))","v":""},null,null,null,null,{"$f":"IF(PG!L75=0,\"\",(IF(AND(PG!F77=1,PG!F78=1,OR(F28=\"ピアザホール(本番)\", F28=\"ピアザホール(準備)\",F28=\"練習室(一般)\",F28=\"練習室(学生)\")),PG!M75, PG!L75)))","v":""},null,null,null,null,{"$f":"IF(SUM(M28:AF29)=0,\"\",SUM(M28:AF29))","v":""}]
[]
[null,null,null,null,null,null,null,null,null,null,null,null,{"$f":"IF(PG!I79=0, \"\", PG!I79)","v":""},null,null,null,null,{"$f":"IF(PG!J79=0, \"\", PG!J79)","v":""},null,null,null,null,{"$f":"IF(PG!K79=0,\"\",(IF(AND(PG!F81=1,PG!F82=1,OR(F30=\"ピアザホール(本番)\", F30=\"ピアザホール(準備)\",F30=\"練習室(一般)\",F30=\"練習室(学生)\")),PG!M79, PG!K79)))","v":""},null,null,null,null,{"$f":"IF(PG!L79=0,\"\",(IF(AND(PG!F81=1,PG!F82=1,OR(F30=\"ピアザホール(本番)\", F30=\"ピアザホール(準備)\",F30=\"練習室(一般)\",F30=\"練習室(学生)\")),PG!M79, PG!L79)))","v":""},null,null,null,null,{"$f":"IF(SUM(M30:AF31)=0,\"\",SUM(M30:AF31))","v":""}]
[]
[null,null,null,null,null,null,null,null,null,null,null,null,{"$f":"IF(PG!I83=0, \"\", PG!I83)","v":""},null,null,null,null,{"$f":"IF(PG!J83=0, \"\", PG!J83)","v":""},null,null,null,null,{"$f":"IF(PG!K83=0,\"\",(IF(AND(PG!F85=1,PG!F86=1,OR(F32=\"ピアザホール(本番)\", F32=\"ピアザホール(準備)\",F32=\"練習室(一般)\",F32=\"練習室(学生)\")),PG!M83, PG!K83)))","v":""},null,null,null,null,{"$f":"IF(PG!L83=0,\"\",(IF(AND(PG!F85=1,PG!F86=1,OR(F32=\"ピアザホール(本番)\", F32=\"ピアザホール(準備)\",F32=\"練習室(一般)\",F32=\"練習室(学生)\")),PG!M83, PG!L83)))","v":""},null,null,null,null,{"$f":"IF(SUM(M32:AF33)=0,\"\",SUM(M32:AF33))","v":""}]
[]
[null,null,null,null,null,null,null,null,null,null,null,null,{"$f":"IF(PG!I87=0, \"\", PG!I87)","v":""},null,null,null,null,{"$f":"IF(PG!J87=0, \"\", PG!J87)","v":""},null,null,null,null,{"$f":"IF(PG!K87=0,\"\",(IF(AND(PG!F89=1,PG!F90=1,OR(F34=\"ピアザホール(本番)\", F34=\"ピアザホール(準備)\",F34=\"練習室(一般)\",F34=\"練習室(学生)\")),PG!M87, PG!K87)))","v":""},null,null,null,null,{"$f":"IF(PG!L87=0,\"\",(IF(AND(PG!F89=1,PG!F90=1,OR(F34=\"ピアザホール(本番)\", F34=\"ピアザホール(準備)\",F34=\"練習室(一般)\",F34=\"練習室(学生)\")),PG!M87, PG!L87)))","v":""},null,null,null,null,{"$f":"IF(SUM(M34:AF35)=0,\"\",SUM(M34:AF35))","v":""}]
[]
[null,null,null,null,null,null,null,null,null,null,null,null,{"$f":"IF(PG!I91=0, \"\", PG!I91)","v":""},null,null,null,null,{"$f":"IF(PG!J91=0, \"\", PG!J91)","v":""},null,null,null,null,{"$f":"IF(PG!K91=0,\"\",(IF(AND(PG!F93=1,PG!F94=1,OR(F36=\"ピアザホール(本番)\", F36=\"ピアザホール(準備)\",F36=\"練習室(一般)\",F36=\"練習室(学生)\")),PG!M91, PG!K91)))","v":""},null,null,null,null,{"$f":"IF(PG!L91=0,\"\",(IF(AND(PG!F93=1,PG!F94=1,OR(F36=\"ピアザホール(本番)\", F36=\"ピアザホール(準備)\",F36=\"練習室(一般)\",F36=\"練習室(学生)\")),PG!M91, PG!L91)))","v":""},null,null,null,null,{"$f":"IF(SUM(M36:AF37)=0,\"\",SUM(M36:AF37))","v":""}]
[]
[null,null,null,null,null,null,null,null,null,null,null,null,{"$f":"IF(PG!I95=0, \"\", PG!I95)","v":""},null,null,null,null,{"$f":"IF(PG!J95=0, \"\", PG!J95)","v":""},null,null,null,null,{"$f":"IF(PG!K95=0,\"\",(IF(AND(PG!F97=1,PG!F98=1,OR(F38=\"ピアザホール(本番)\", F38=\"ピアザホール(準備)\",F38=\"練習室(一般)\",F38=\"練習室(学生)\")),PG!M95, PG!K95)))","v":""},null,null,null,null,{"$f":"IF(PG!L95=0,\"\",(IF(AND(PG!F97=1,PG!F98=1,OR(F38=\"ピアザホール(本番)\", F38=\"ピアザホール(準備)\",F38=\"練習室(一般)\",F38=\"練習室(学生)\")),PG!M95, PG!L95)))","v":""},null,null,null,null,{"$f":"IF(SUM(M38:AF39)=0,\"\",SUM(M38:AF39))","v":""}]
[]
[null,null,null,null,null,null,null,null,null,null,null,null,{"$f":"IF(PG!I99=0, \"\", PG!I99)","v":""},null,null,null,null,{"$f":"IF(PG!J99=0, \"\", PG!J99)","v":""},null,null,null,null,{"$f":"IF(PG!K99=0,\"\",(IF(AND(PG!F101=1,PG!F102=1,OR(F40=\"ピアザホール(本番)\", F40=\"ピアザホール(準備)\",F40=\"練習室(一般)\",F40=\"練習室(学生)\")),PG!M99, PG!K99)))","v":""},null,null,null,null,{"$f":"IF(PG!L99=0,\"\",(IF(AND(PG!F101=1,PG!F102=1,OR(F40=\"ピアザホール(本番)\", F40=\"ピアザホール(準備)\",F40=\"練習室(一般)\",F40=\"練習室(学生)\")),PG!M99, PG!L99)))","v":""},null,null,null,null,{"$f":"IF(SUM(M40:AF41)=0,\"\",SUM(M40:AF41))","v":""}]
[]
[null,null,null,null,null,null,null,null,null,null,null,null,{"$f":"IF(PG!I103=0, \"\", PG!I103)","v":""},null,null,null,null,{"$f":"IF(PG!J103=0, \"\", PG!J103)","v":""},null,null,null,null,{"$f":"IF(PG!K103=0,\"\",(IF(AND(PG!F105=1,PG!F106=1,OR(F42=\"ピアザホール(本番)\", F42=\"ピアザホール(準備)\",F42=\"練習室(一般)\",F42=\"練習室(学生)\")),PG!M103, PG!K103)))","v":""},null,null,null,null,{"$f":"IF(PG!L103=0,\"\",(IF(AND(PG!F105=1,PG!F106=1,OR(F42=\"ピアザホール(本番)\", F42=\"ピアザホール(準備)\",F42=\"練習室(一般)\",F42=\"練習室(学生)\")),PG!M103, PG!L103)))","v":""},null,null,null,null,{"$f":"IF(SUM(M42:AF43)=0,\"\",SUM(M42:AF43))","v":""}]
[]
[null,null,null,null,null,null,null,null,null,null,null,null,{"$f":"IF(PG!I107=0, \"\", PG!I107)","v":""},null,null,null,null,{"$f":"IF(PG!J107=0, \"\", PG!J107)","v":""},null,null,null,null,{"$f":"IF(PG!K107=0,\"\",(IF(AND(PG!F109=1,PG!F110=1,OR(F44=\"ピアザホール(本番)\", F44=\"ピアザホール(準備)\",F44=\"練習室(一般)\",F44=\"練習室(学生)\")),PG!M107, PG!K107)))","v":""},null,null,null,null,{"$f":"IF(PG!L107=0,\"\",(IF(AND(PG!F109=1,PG!F110=1,OR(F44=\"ピアザホール(本番)\", F44=\"ピアザホール(準備)\",F44=\"練習室(一般)\",F44=\"練習室(学生)\")),PG!M107, PG!L107)))","v":""},null,null,null,null,{"$f":"IF(SUM(M44:AF45)=0,\"\",SUM(M44:AF45))","v":""}]
[]
[null,null,null,null,null,null,null,null,null,null,null,null,{"$f":"IF(PG!I111=0, \"\", PG!I111)","v":""},null,null,null,null,{"$f":"IF(PG!J111=0, \"\", PG!J111)","v":""},null,null,null,null,{"$f":"IF(PG!K111=0,\"\",(IF(AND(PG!F113=1,PG!F114=1,OR(F46=\"ピアザホール(本番)\", F46=\"ピアザホール(準備)\",F46=\"練習室(一般)\",F46=\"練習室(学生)\")),PG!M111, PG!K111)))","v":""},null,null,null,null,{"$f":"IF(PG!L111=0,\"\",(IF(AND(PG!F113=1,PG!F114=1,OR(F46=\"ピアザホール(本番)\", F46=\"ピアザホール(準備)\",F46=\"練習室(一般)\",F46=\"練習室(学生)\")),PG!M111, PG!L111)))","v":""},null,null,null,null,{"$f":"IF(SUM(M46:AF47)=0,\"\",SUM(M46:AF47))","v":""}]
[]
[null,null,null,null,null,null,null,null,null,null,null,null,{"$f":"IF(PG!I115=0, \"\", PG!I115)","v":""},null,null,null,null,{"$f":"IF(PG!J115=0, \"\", PG!J115)","v":""},null,null,null,null,{"$f":"IF(PG!K115=0,\"\",(IF(AND(PG!F117=1,PG!F118=1,OR(F48=\"ピアザホール(本番)\", F48=\"ピアザホール(準備)\",F48=\"練習室(一般)\",F48=\"練習室(学生)\")),PG!M115, PG!K115)))","v":""},null,null,null,null,{"$f":"IF(PG!L115=0,\"\",(IF(AND(PG!F117=1,PG!F118=1,OR(F48=\"ピアザホール(本番)\", F48=\"ピアザホール(準備)\",F48=\"練習室(一般)\",F48=\"練習室(学生)\")),PG!M115, PG!L115)))","v":""},null,null,null,null,{"$f":"IF(SUM(M48:AF49)=0,\"\",SUM(M48:AF49))","v":""}]
[]
[null,null,null,null,null,null,null,null,null,null,null,null,{"$f":"IF(PG!I119=0, \"\", PG!I119)","v":""},null,null,null,null,{"$f":"IF(PG!J119=0, \"\", PG!J119)","v":""},null,null,null,null,{"$f":"IF(PG!K119=0,\"\",(IF(AND(PG!F121=1,PG!F122=1,OR(F50=\"ピアザホール(本番)\", F50=\"ピアザホール(準備)\",F50=\"練習室(一般)\",F50=\"練習室(学生)\")),PG!M119, PG!K119)))","v":""},null,null,null,null,{"$f":"IF(PG!L119=0,\"\",(IF(AND(PG!F121=1,PG!F122=1,OR(F50=\"ピアザホール(本番)\", F50=\"ピアザホール(準備)\",F50=\"練習室(一般)\",F50=\"練習室(学生)\")),PG!M119, PG!L119)))","v":""},null,null,null,null,{"$f":"IF(SUM(M50:AF51)=0,\"\",SUM(M50:AF51))","v":""}]
[]
[null,null,null,null,null,null,null,null,null,null,null,null,{"$f":"IF(PG!I123=0, \"\", PG!I123)","v":""},null,null,null,null,{"$f":"IF(PG!J123=0, \"\", PG!J123)","v":""},null,null,null,null,{"$f":"IF(PG!K123=0,\"\",(IF(AND(PG!F125=1,PG!F126=1,OR(F52=\"ピアザホール(本番)\", F52=\"ピアザホール(準備)\",F52=\"練習室(一般)\",F52=\"練習室(学生)\")),PG!M123, PG!K123)))","v":""},null,null,null,null,{"$f":"IF(PG!L123=0,\"\",(IF(AND(PG!F125=1,PG!F126=1,OR(F52=\"ピアザホール(本番)\", F52=\"ピアザホール(準備)\",F52=\"練習室(一般)\",F52=\"練習室(学生)\")),PG!M123, PG!L123)))","v":""},null,null,null,null,{"$f":"IF(SUM(M52:AF53)=0,\"\",SUM(M52:AF53))","v":""}]
[]
[null,null,null,null,null,null,null,null,null,null,null,null,{"$f":"IF(PG!I127=0, \"\", PG!I127)","v":""},null,null,null,null,{"$f":"IF(PG!J127=0, \"\", PG!J127)","v":""},null,null,null,null,{"$f":"IF(PG!K127=0,\"\",(IF(AND(PG!F129=1,PG!F130=1,OR(F54=\"ピアザホール(本番)\", F54=\"ピアザホール(準備)\",F54=\"練習室(一般)\",F54=\"練習室(学生)\")),PG!M127, PG!K127)))","v":""},null,null,null,null,{"$f":"IF(PG!L127=0,\"\",(IF(AND(PG!F129=1,PG!F130=1,OR(F54=\"ピアザホール(本番)\", F54=\"ピアザホール(準備)\",F54=\"練習室(一般)\",F54=\"練習室(学生)\")),PG!M127, PG!L127)))","v":""},null,null,null,null,{"$f":"IF(SUM(M54:AF55)=0,\"\",SUM(M54:AF55))","v":""}]
[]
[null,null,null,null,null,null,null,null,null,null,null,null,null,null,null,null,null,null,null,null,null,null,null,null,null,null,null,{"$f":"SUM(AG10:AL55)","v":0},null,null,null,null,null,null,null,null,null,null,"承認印"]
[]
["ｾﾝﾀｰ処理欄"]
[]
[]
[]
[]
[null,null,null,null,null,null,null,null,null,null,null,null,null,null,null,null,null,null,null,null,null,"受付",null,null,"台帳記入"]
[null,null,null,null,null,null,null,null,null,null,null,null,null,null,null,null,null,null,null,null,null,null,null,null,null,null,null,null,null,null,null,null,null,"上記の通り利用を承認します。"]
[null,null,null,null,null,null,null,null,null,null,null,null,null,null,null,null,null,null,null,null,null,null,null,null,null,null,null,null,null,null,null,null,null,"印のないものは無効です。"]
[null,null,null,null,null,null,null,null,null,null,null,null,null,null,null,null,null,null,null,null,null,null,null,null,null,null,null,null,null,null,null,null,null,null,null,null,null,null,null,null,null,null,null,{"$f":"#REF!*10000+#REF!*1000+#REF!*100+#REF!*10+#REF!","v":{"$error":"#REF!"}},{"$f":"#REF!*10000+#REF!*1000+#REF!*100+#REF!*10+#REF!","v":{"$error":"#REF!"}},{"$f":"#REF!*10000+#REF!*1000+#REF!*100+#REF!*10+#REF!","v":{"$error":"#REF!"}},{"$f":"SUM(AR66:AT66)","v":{"$error":"#REF!"}}]
[null,null,null,null,null,null,null,null,null,null,null,null,null,null,null,null,null,null,null,null,null,null,null,null,"  滋賀県立県民交流センター",null,null,null,null,null,null,null,null,null,null,null,null,null,null,null,null,null,null,{"$f":"#REF!*10000+#REF!*1000+#REF!*100+#REF!*10+#REF!","v":{"$error":"#REF!"}},{"$f":"#REF!*10000+#REF!*1000+#REF!*100+#REF!*10+#REF!","v":{"$error":"#REF!"}},{"$f":"#REF!*10000+#REF!*1000+#REF!*100+#REF!*10+#REF!","v":{"$error":"#REF!"}},{"$f":"SUM(AR67:AT67)","v":{"$error":"#REF!"}}]
[null,null,null,null,null,null,null,null,null,null,null,null,null,null,null,null,null,null,null,null,null,null,null,null," 指定管理者　 株式会社コンベンションリンケージ",null,null,null,null,null,null,null,null,null,null,null,null,null,null,null,null,null,null,{"$f":"#REF!*10000+#REF!*1000+#REF!*100+#REF!*10+#REF!","v":{"$error":"#REF!"}},{"$f":"#REF!*10000+#REF!*1000+#REF!*100+#REF!*10+#REF!","v":{"$error":"#REF!"}},{"$f":"#REF!*10000+#REF!*1000+#REF!*100+#REF!*10+#REF!","v":{"$error":"#REF!"}},{"$f":"SUM(AR68:AT68)","v":{"$error":"#REF!"}}]
[null,null,null,null,null,null,null,null,null,null,null,null,null,null,null,null,null,null,null,null,null,null,null,null,null,null,null,null,null,null,null,null,null,null,null,null,null,null,null,null,null,null,null,{"$f":"#REF!*10000+#REF!*1000+#REF!*100+#REF!*10+#REF!","v":{"$error":"#REF!"}},{"$f":"#REF!*10000+#REF!*1000+#REF!*100+#REF!*10+#REF!","v":{"$error":"#REF!"}},{"$f":"#REF!*10000+#REF!*1000+#REF!*100+#REF!*10+#REF!","v":{"$error":"#REF!"}},{"$f":"SUM(AR69:AT69)","v":{"$error":"#REF!"}}]
[null,null,null,null,null,null,null,null,null,null,null,null,null,null,null,null,null,null,null,null,null,null,null,null,null,null,null,null,null,null,null,null,null,null,null,null,null,null,null,null,null,null,null,{"$f":"#REF!*10000+#REF!*1000+#REF!*100+#REF!*10+#REF!","v":{"$error":"#REF!"}},{"$f":"#REF!*10000+#REF!*1000+#REF!*100+#REF!*10+#REF!","v":{"$error":"#REF!"}},{"$f":"#REF!*10000+#REF!*1000+#REF!*100+#REF!*10+#REF!","v":{"$error":"#REF!"}},{"$f":"SUM(AR70:AT70)","v":{"$error":"#REF!"}}]
[null,null,null,null,null,null,null,null,null,null,null,null,null,null,null,null,null,null,null,null,null,null,null,null,null,null,null,null,null,null,null,null,null,null,null,null,null,null,null,null,null,null,null,null,null,null,{"$f":"SUM(AU66:AU70)","v":{"$error":"#REF!"}}]

{"sheet":"利用申込書3","index":2,"n_rows":71,"n_cols":48,"rows_kept":71,"cut":false,"hidden":false,"merged":[[0,5,0,41],[1,24,1,28],[2,29,2,33],[4,5,5,41],[7,0,8,4],[7,5,8,11],[7,19,7,31],[7,32,8,37],[7,38,8,42],[8,12,8,16],[8,17,8,21],[8,22,8,26],[8,27,8,31],[13,38,14,42],[13,43,14,46],[15,38,16,42],[15,43,16,46],[9,0,10,4],[9,5,10,11],[9,12,10,16],[9,17,10,21],[9,22,10,26],[9,27,10,31],[9,32,10,37],[11,0,12,4],[11,5,12,11],[11,12,12,16],[11,17,12,21],[11,22,12,26],[11,27,12,31],[11,32,12,37],[9,38,10,42],[9,43,10,46],[11,38,12,42],[11,43,12,46],[13,32,14,37],[15,0,16,4],[15,5,16,11],[15,12,16,16],[15,17,16,21],[15,22,16,26],[15,27,16,31],[15,32,16,37],[13,0,14,4],[13,5,14,11],[13,12,14,16],[13,17,14,21],[13,22,14,26],[13,27,14,31],[21,38,22,42],[21,43,22,46],[23,38,24,42],[23,43,24,46],[17,32,18,37],[19,0,20,4],[19,5,20,11],[19,12,20,16],[19,17,20,21],[19,22,20,26],[19,27,20,31],[19,32,20,37],[17,0,18,4],[17,5,18,11],[17,12,18,16],[17,17,18,21],[17,22,18,26],[17,27,18,31],[17,38,18,42],[17,43,18,46],[19,38,20,42],[19,43,20,46],[21,32,22,37],[23,0,24,4],[23,5,24,11],[23,12,24,16],[23,17,24,21],[23,22,24,26],[23,27,24,31],[23,32,24,37],[21,0,22,4],[21,5,22,11],[21,12,22,16],[21,17,22,21],[21,22,22,26],[21,27,22,31],[29,38,30,42],[29,43,30,46],[31,38,32,42],[31,43,32,46],[25,32,26,37],[27,0,28,4],[27,5,28,11],[27,12,28,16],[27,17,28,21],[27,22,28,26],[27,27,28,31],[27,32,28,37],[25,0,26,4],[25,5,26,11],[25,12,26,16],[25,17,26,21],[25,22,26,26],[25,27,26,31],[25,38,26,42],[25,43,26,46],[27,38,28,42],[27,43,28,46],[29,32,30,37],[31,0,32,4],[31,5,32,11],[31,12,32,16],[31,17,32,21],[31,22,32,26],[31,27,32,31],[31,32,32,37],[29,0,30,4],[29,5,30,11],[29,12,30,16],[29,17,30,21],[29,22,30,26],[29,27,30,31],[37,38,38,42],[37,43,38,46],[39,38,40,42],[39,43,40,46],[33,32,34,37],[35,0,36,4],[35,5,36,11],[35,12,36,16],[35,17,36,21],[35,22,36,26],[35,27,36,31],[35,32,36,37],[33,0,34,4],[33,5,34,11],[33,12,34,16],[33,17,34,21],[33,22,34,26],[33,27,34,31],[33,38,34,42],[33,43,34,46],[35,38,36,42],[35,43,36,46],[37,32,38,37],[39,0,40,4],[39,5,40,11],[39,12,40,16],[39,17,40,21],[39,22,40,26],[39,27,40,31],[39,32,40,37],[37,0,38,4],[37,5,38,11],[37,12,38,16],[37,17,38,21],[37,22,38,26],[37,27,38,31],[45,38,46,42],[45,43,46,46],[47,38,48,42],[47,43,48,46],[41,32,42,37],[43,0,44,4],[43,5,44,11],[43,12,44,16],[43,17,44,21],[43,22,44,26],[43,27,44,31],[43,32,44,37],[41,0,42,4],[41,5,42,11],[41,12,42,16],[41,17,42,21],[41,22,42,26],[41,27,42,31],[41,38,42,42],[41,43,42,46],[43,38,44,42],[43,43,44,46],[45,32,46,37],[47,0,48,4],[47,5,48,11],[47,12,48,16],[47,17,48,21],[47,22,48,26],[47,27,48,31],[47,32,48,37],[45,0,46,4],[45,5,46,11],[45,12,46,16],[45,17,46,21],[45,22,46,26],[45,27,46,31],[53,43,54,46],[49,32,50,37],[51,0,52,4],[51,5,52,11],[51,12,52,16],[51,17,52,21],[51,22,52,26],[51,27,52,31],[51,32,52,37],[49,0,50,4],[49,5,50,11],[49,12,50,16],[49,17,50,21],[49,22,50,26],[49,27,50,31],[49,38,50,42],[49,43,50,46],[51,38,52,42],[51,43,52,46],[53,32,54,37],[55,5,56,26],[55,27,56,37],[55,38,56,42],[53,0,54,4],[53,5,54,11],[53,12,54,16],[53,17,54,21],[53,22,54,26],[53,27,54,31],[53,38,54,42]]}
[]
[null,null,"<<<<",null,"　続き用2　>>>>"]
[null,null,null,null,"滋賀県立県民交流センター",null,null,null,null,null,null,null,null,null,null,null,null,null,null,null,null,null,null,null,null,null,null,null,null,"申込日",null,null,null,null,"　　　年　　　月　　　日（　　　）"]
[null,null,null,null,"　　( 指定管理者　 株式会社コンベンションリンケージ)"]
[]
[null,null,null,null,"　　利用に際しては、県条例によるピアザ淡海滋賀県立県民交流センター利用規定並びにこれに基づく指示に従います。"]
[]
["ご利用日\n*次の書式で半角\n　で入力ください。\n 20〇〇/〇〇/〇〇",null,null,null,null,"会 議 室 名",null,null,null,null,null,null,null,"利　用　区　分",null,null,null,null,null,"利用する各区のチェックボックスをクリック\nください。",null,null,null,null,null,null,null,null,null,null,null,null,"利用料小計",null,null,null,null,null,"備　　　　考"]
[null,null,null,null,null,null,null,null,null,null,null,null,"早朝開室\n　(8-9時)",null,null,null,null,"午前\n　(9-12時)",null,null,null,null,"午後　\n(13-17時)",null,null,null,null,"夜間\n　(18-21時)"]
[null,null,null,null,null,0,null,null,null,null,null,null,{"$f":"IF(PG!I131=0, \"\", PG!I131)","v":""},null,null,null,null,{"$f":"IF(PG!J131=0, \"\", PG!J131)","v":""},null,null,null,null,{"$f":"IF(PG!K131=0,\"\",(IF(AND(PG!F133=1,PG!F134=1,OR(F10=\"ピアザホール(本番)\", F10=\"ピアザホール(準備)\",F10=\"練習室(一般)\",F10=\"練習室(学生)\")),PG!M131, PG!K131)))","v":""},null,null,null,null,{"$f":"IF(PG!L131=0,\"\",(IF(AND(PG!F133=1,PG!F134=1,OR(F10=\"ピアザホール(本番)\", F10=\"ピアザホール(準備)\",F10=\"練習室(一般)\",F10=\"練習室(学生)\")),PG!M131, PG!L131)))","v":""},null,null,null,null,{"$f":"IF(SUM(M10:AF11)=0,\"\",SUM(M10:AF11))","v":""}]
[]
[null,null,null,null,null,0,null,null,null,null,null,null,{"$f":"IF(PG!I135=0, \"\", PG!I135)","v":""},null,null,null,null,{"$f":"IF(PG!J135=0, \"\", PG!J135)","v":""},null,null,null,null,{"$f":"IF(PG!K135=0,\"\",(IF(AND(PG!F137=1,PG!F138=1,OR(F12=\"ピアザホール(本番)\", F12=\"ピアザホール(準備)\",F12=\"練習室(一般)\",F12=\"練習室(学生)\")),PG!M135, PG!K135)))","v":""},null,null,null,null,{"$f":"IF(PG!L135=0,\"\",(IF(AND(PG!F137=1,PG!F138=1,OR(F12=\"ピアザホール(本番)\", F12=\"ピアザホール(準備)\",F12=\"練習室(一般)\",F12=\"練習室(学生)\")),PG!M135, PG!L135)))","v":""},null,null,null,null,{"$f":"IF(SUM(M12:AF13)=0,\"\",SUM(M12:AF13))","v":""}]
[]
[null,null,null,null,null,0,null,null,null,null,null,null,{"$f":"IF(PG!I139=0, \"\", PG!I139)","v":""},null,null,null,null,{"$f":"IF(PG!J139=0, \"\", PG!J139)","v":""},null,null,null,null,{"$f":"IF(PG!K139=0,\"\",(IF(AND(PG!F141=1,PG!F142=1,OR(F14=\"ピアザホール(本番)\", F14=\"ピアザホール(準備)\",F14=\"練習室(一般)\",F14=\"練習室(学生)\")),PG!M139, PG!K139)))","v":""},null,null,null,null,{"$f":"IF(PG!L139=0,\"\",(IF(AND(PG!F141=1,PG!F142=1,OR(F14=\"ピアザホール(本番)\", F14=\"ピアザホール(準備)\",F14=\"練習室(一般)\",F14=\"練習室(学生)\")),PG!M139, PG!L139)))","v":""},null,null,null,null,{"$f":"IF(SUM(M14:AF15)=0,\"\",SUM(M14:AF15))","v":""}]
[]
[null,null,null,null,null,null,null,null,null,null,null,null,{"$f":"IF(PG!I143=0, \"\", PG!I143)","v":""},null,null,null,null,{"$f":"IF(PG!J143=0, \"\", PG!J143)","v":""},null,null,null,null,{"$f":"IF(PG!K143=0,\"\",(IF(AND(PG!F145=1,PG!F146=1,OR(F16=\"ピアザホール(本番)\", F16=\"ピアザホール(準備)\",F16=\"練習室(一般)\",F16=\"練習室(学生)\")),PG!M143, PG!K143)))","v":""},null,null,null,null,{"$f":"IF(PG!L143=0,\"\",(IF(AND(PG!F145=1,PG!F146=1,OR(F16=\"ピアザホール(本番)\", F16=\"ピアザホール(準備)\",F16=\"練習室(一般)\",F16=\"練習室(学生)\")),PG!M143, PG!L143)))","v":""},null,null,null,null,{"$f":"IF(SUM(M16:AF17)=0,\"\",SUM(M16:AF17))","v":""}]
[]
[null,null,null,null,null,null,null,null,null,null,null,null,{"$f":"IF(PG!I147=0, \"\", PG!I147)","v":""},null,null,null,null,{"$f":"IF(PG!J147=0, \"\", PG!J147)","v":""},null,null,null,null,{"$f":"IF(PG!K147=0,\"\",(IF(AND(PG!F149=1,PG!F150=1,OR(F18=\"ピアザホール(本番)\", F18=\"ピアザホール(準備)\",F18=\"練習室(一般)\",F18=\"練習室(学生)\")),PG!M147, PG!K147)))","v":""},null,null,null,null,{"$f":"IF(PG!L147=0,\"\",(IF(AND(PG!F149=1,PG!F150=1,OR(F18=\"ピアザホール(本番)\", F18=\"ピアザホール(準備)\",F18=\"練習室(一般)\",F18=\"練習室(学生)\")),PG!M147, PG!L147)))","v":""},null,null,null,null,{"$f":"IF(SUM(M18:AF19)=0,\"\",SUM(M18:AF19))","v":""},null,null,null,null,null,null,null,null,null,null,null,null,null,null,{"$f":"TEXT(AU66,\"??????\")","v":{"$error":"#REF!"}}]
[null,null,null,null,null,null,null,null,null,null,null,null,null,null,null,null,null,null,null,null,null,null,null,null,null,null,null,null,null,null,null,null,null,null,null,null,null,null,null,null,null,null,null,null,null,null,null,{"$error":"#REF!"}]
[null,null,null,null,null,null,null,null,null,null,null,null,{"$f":"IF(PG!I151=0, \"\", PG!I151)","v":""},null,null,null,null,{"$f":"IF(PG!J151=0, \"\", PG!J151)","v":""},null,null,null,null,{"$f":"IF(PG!K151=0,\"\",(IF(AND(PG!F153=1,PG!F154=1,OR(F20=\"ピアザホール(本番)\", F20=\"ピアザホール(準備)\",F20=\"練習室(一般)\",F20=\"練習室(学生)\")),PG!M151, PG!K151)))","v":""},null,null,null,null,{"$f":"IF(PG!L151=0,\"\",(IF(AND(PG!F153=1,PG!F154=1,OR(F20=\"ピアザホール(本番)\", F20=\"ピアザホール(準備)\",F20=\"練習室(一般)\",F20=\"練習室(学生)\")),PG!M151, PG!L151)))","v":""},null,null,null,null,{"$f":"IF(SUM(M20:AF21)=0,\"\",SUM(M20:AF21))","v":""},null,null,null,null,null,null,null,null,null,null,null,null,null,null,{"$error":"#REF!"}]
[null,null,null,null,null,null,null,null,null,null,null,null,null,null,null,null,null,null,null,null,null,null,null,null,null,null,null,null,null,null,null,null,null,null,null,null,null,null,null,null,null,null,null,null,null,null,null,{"$error":"#REF!"}]
[null,null,null,null,null,null,null,null,null,null,null,null,{"$f":"IF(PG!I155=0, \"\", PG!I155)","v":""},null,null,null,null,{"$f":"IF(PG!J155=0, \"\", PG!J155)","v":""},null,null,null,null,{"$f":"IF(PG!K155=0,\"\",(IF(AND(PG!F157=1,PG!F158=1,OR(F22=\"ピアザホール(本番)\", F22=\"ピアザホール(準備)\",F22=\"練習室(一般)\",F22=\"練習室(学生)\")),PG!M155, PG!K155)))","v":""},null,null,null,null,{"$f":"IF(PG!L155=0,\"\",(IF(AND(PG!F157=1,PG!F158=1,OR(F22=\"ピアザホール(本番)\", F22=\"ピアザホール(準備)\",F22=\"練習室(一般)\",F22=\"練習室(学生)\")),PG!M155, PG!L155)))","v":""},null,null,null,null,{"$f":"IF(SUM(M22:AF23)=0,\"\",SUM(M22:AF23))","v":""},null,null,null,null,null,null,null,null,null,null,null,null,null,null,{"$error":"#REF!"}]
[null,null,null,null,null,null,null,null,null,null,null,null,null,null,null,null,null,null,null,null,null,null,null,null,null,null,null,null,null,null,null,null,null,null,null,null,null,null,null,null,null,null,null,null,null,null,null,{"$error":"#REF!"}]
[null,null,null,null,null,null,null,null,null,null,null,null,{"$f":"IF(PG!I159=0, \"\", PG!I159)","v":""},null,null,null,null,{"$f":"IF(PG!J159=0, \"\", PG!J159)","v":""},null,null,null,null,{"$f":"IF(PG!K159=0,\"\",(IF(AND(PG!F161=1,PG!F162=1,OR(F24=\"ピアザホール(本番)\", F24=\"ピアザホール(準備)\",F24=\"練習室(一般)\",F24=\"練習室(学生)\")),PG!M159, PG!K159)))","v":""},null,null,null,null,{"$f":"IF(PG!L159=0,\"\",(IF(AND(PG!F161=1,PG!F162=1,OR(F24=\"ピアザホール(本番)\", F24=\"ピアザホール(準備)\",F24=\"練習室(一般)\",F24=\"練習室(学生)\")),PG!M159, PG!L159)))","v":""},null,null,null,null,{"$f":"IF(SUM(M24:AF25)=0,\"\",SUM(M24:AF25))","v":""}]
[]
[null,null,null,null,null,null,null,null,null,null,null,null,{"$f":"IF(PG!I163=0, \"\", PG!I163)","v":""},null,null,null,null,{"$f":"IF(PG!J163=0, \"\", PG!J163)","v":""},null,null,null,null,{"$f":"IF(PG!K163=0,\"\",(IF(AND(PG!F165=1,PG!F166=1,OR(F26=\"ピアザホール(本番)\", F26=\"ピアザホール(準備)\",F26=\"練習室(一般)\",F26=\"練習室(学生)\")),PG!M163, PG!K163)))","v":""},null,null,null,null,{"$f":"IF(PG!L163=0,\"\",(IF(AND(PG!F165=1,PG!F166=1,OR(F26=\"ピアザホール(本番)\", F26=\"ピアザホール(準備)\",F26=\"練習室(一般)\",F26=\"練習室(学生)\")),PG!M163, PG!L163)))","v":""},null,null,null,null,{"$f":"IF(SUM(M26:AF27)=0,\"\",SUM(M26:AF27))","v":""}]
[]
[null,null,null,null,null,null,null,null,null,null,null,null,{"$f":"IF(PG!I167=0, \"\", PG!I167)","v":""},null,null,null,null,{"$f":"IF(PG!J167=0, \"\", PG!J167)","v":""},null,null,null,null,{"$f":"IF(PG!K167=0,\"\",(IF(AND(PG!F169=1,PG!F170=1,OR(F28=\"ピアザホール(本番)\", F28=\"ピアザホール(準備)\",F28=\"練習室(一般)\",F28=\"練習室(学生)\")),PG!M167, PG!K167)))","v":""},null,null,null,null,{"$f":"IF(PG!L167=0,\"\",(IF(AND(PG!F169=1,PG!F170=1,OR(F28=\"ピアザホール(本番)\", F28=\"ピアザホール(準備)\",F28=\"練習室(一般)\",F28=\"練習室(学生)\")),PG!M167, PG!L167)))","v":""},null,null,null,null,{"$f":"IF(SUM(M28:AF29)=0,\"\",SUM(M28:AF29))","v":""}]
[]
[null,null,null,null,null,null,null,null,null,null,null,null,{"$f":"IF(PG!I171=0, \"\", PG!I171)","v":""},null,null,null,null,{"$f":"IF(PG!J171=0, \"\", PG!J171)","v":""},null,null,null,null,{"$f":"IF(PG!K171=0,\"\",(IF(AND(PG!F173=1,PG!F174=1,OR(F30=\"ピアザホール(本番)\", F30=\"ピアザホール(準備)\",F30=\"練習室(一般)\",F30=\"練習室(学生)\")),PG!M171, PG!K171)))","v":""},null,null,null,null,{"$f":"IF(PG!L171=0,\"\",(IF(AND(PG!F173=1,PG!F174=1,OR(F30=\"ピアザホール(本番)\", F30=\"ピアザホール(準備)\",F30=\"練習室(一般)\",F30=\"練習室(学生)\")),PG!M171, PG!L171)))","v":""},null,null,null,null,{"$f":"IF(SUM(M30:AF31)=0,\"\",SUM(M30:AF31))","v":""}]
[]
[null,null,null,null,null,null,null,null,null,null,null,null,{"$f":"IF(PG!I175=0, \"\", PG!I175)","v":""},null,null,null,null,{"$f":"IF(PG!J175=0, \"\", PG!J175)","v":""},null,null,null,null,{"$f":"IF(PG!K175=0,\"\",(IF(AND(PG!F177=1,PG!F178=1,OR(F32=\"ピアザホール(本番)\", F32=\"ピアザホール(準備)\",F32=\"練習室(一般)\",F32=\"練習室(学生)\")),PG!M175, PG!K175)))","v":""},null,null,null,null,{"$f":"IF(PG!L175=0,\"\",(IF(AND(PG!F177=1,PG!F178=1,OR(F32=\"ピアザホール(本番)\", F32=\"ピアザホール(準備)\",F32=\"練習室(一般)\",F32=\"練習室(学生)\")),PG!M175, PG!L175)))","v":""},null,null,null,null,{"$f":"IF(SUM(M32:AF33)=0,\"\",SUM(M32:AF33))","v":""}]
[]
[null,null,null,null,null,null,null,null,null,null,null,null,{"$f":"IF(PG!I179=0, \"\", PG!I179)","v":""},null,null,null,null,{"$f":"IF(PG!J179=0, \"\", PG!J179)","v":""},null,null,null,null,{"$f":"IF(PG!K179=0,\"\",(IF(AND(PG!F181=1,PG!F182=1,OR(F34=\"ピアザホール(本番)\", F34=\"ピアザホール(準備)\",F34=\"練習室(一般)\",F34=\"練習室(学生)\")),PG!M179, PG!K179)))","v":""},null,null,null,null,{"$f":"IF(PG!L179=0,\"\",(IF(AND(PG!F181=1,PG!F182=1,OR(F34=\"ピアザホール(本番)\", F34=\"ピアザホール(準備)\",F34=\"練習室(一般)\",F34=\"練習室(学生)\")),PG!M179, PG!L179)))","v":""},null,null,null,null,{"$f":"IF(SUM(M34:AF35)=0,\"\",SUM(M34:AF35))","v":""}]
[]
[null,null,null,null,null,null,null,null,null,null,null,null,{"$f":"IF(PG!I183=0, \"\", PG!I183)","v":""},null,null,null,null,{"$f":"IF(PG!J183=0, \"\", PG!J183)","v":""},null,null,null,null,{"$f":"IF(PG!K183=0,\"\",(IF(AND(PG!F185=1,PG!F186=1,OR(F36=\"ピアザホール(本番)\", F36=\"ピアザホール(準備)\",F36=\"練習室(一般)\",F36=\"練習室(学生)\")),PG!M183, PG!K183)))","v":""},null,null,null,null,{"$f":"IF(PG!L183=0,\"\",(IF(AND(PG!F185=1,PG!F186=1,OR(F36=\"ピアザホール(本番)\", F36=\"ピアザホール(準備)\",F36=\"練習室(一般)\",F36=\"練習室(学生)\")),PG!M183, PG!L183)))","v":""},null,null,null,null,{"$f":"IF(SUM(M36:AF37)=0,\"\",SUM(M36:AF37))","v":""}]
[]
[null,null,null,null,null,null,null,null,null,null,null,null,{"$f":"IF(PG!I187=0, \"\", PG!I187)","v":""},null,null,null,null,{"$f":"IF(PG!J187=0, \"\", PG!J187)","v":""},null,null,null,null,{"$f":"IF(PG!K187=0,\"\",(IF(AND(PG!F189=1,PG!F190=1,OR(F38=\"ピアザホール(本番)\", F38=\"ピアザホール(準備)\",F38=\"練習室(一般)\",F38=\"練習室(学生)\")),PG!M187, PG!K187)))","v":""},null,null,null,null,{"$f":"IF(PG!L187=0,\"\",(IF(AND(PG!F189=1,PG!F190=1,OR(F38=\"ピアザホール(本番)\", F38=\"ピアザホール(準備)\",F38=\"練習室(一般)\",F38=\"練習室(学生)\")),PG!M187, PG!L187)))","v":""},null,null,null,null,{"$f":"IF(SUM(M38:AF39)=0,\"\",SUM(M38:AF39))","v":""}]
[]
[null,null,null,null,null,null,null,null,null,null,null,null,{"$f":"IF(PG!I191=0, \"\", PG!I191)","v":""},null,null,null,null,{"$f":"IF(PG!J191=0, \"\", PG!J191)","v":""},null,null,null,null,{"$f":"IF(PG!K191=0,\"\",(IF(AND(PG!F193=1,PG!F194=1,OR(F40=\"ピアザホール(本番)\", F40=\"ピアザホール(準備)\",F40=\"練習室(一般)\",F40=\"練習室(学生)\")),PG!M191, PG!K191)))","v":""},null,null,null,null,{"$f":"IF(PG!L191=0,\"\",(IF(AND(PG!F193=1,PG!F194=1,OR(F40=\"ピアザホール(本番)\", F40=\"ピアザホール(準備)\",F40=\"練習室(一般)\",F40=\"練習室(学生)\")),PG!M191, PG!L191)))","v":""},null,null,null,null,{"$f":"IF(SUM(M40:AF41)=0,\"\",SUM(M40:AF41))","v":""}]
[]
[null,null,null,null,null,null,null,null,null,null,null,null,{"$f":"IF(PG!I195=0, \"\", PG!I195)","v":""},null,null,null,null,{"$f":"IF(PG!J195=0, \"\", PG!J195)","v":""},null,null,null,null,{"$f":"IF(PG!K195=0,\"\",(IF(AND(PG!F197=1,PG!F198=1,OR(F42=\"ピアザホール(本番)\", F42=\"ピアザホール(準備)\",F42=\"練習室(一般)\",F42=\"練習室(学生)\")),PG!M195, PG!K195)))","v":""},null,null,null,null,{"$f":"IF(PG!L195=0,\"\",(IF(AND(PG!F197=1,PG!F198=1,OR(F42=\"ピアザホール(本番)\", F42=\"ピアザホール(準備)\",F42=\"練習室(一般)\",F42=\"練習室(学生)\")),PG!M195, PG!L195)))","v":""},null,null,null,null,{"$f":"IF(SUM(M42:AF43)=0,\"\",SUM(M42:AF43))","v":""}]
[]
[null,null,null,null,null,null,null,null,null,null,null,null,{"$f":"IF(PG!I199=0, \"\", PG!I199)","v":""},null,null,null,null,{"$f":"IF(PG!J199=0, \"\", PG!J199)","v":""},null,null,null,null,{"$f":"IF(PG!K199=0,\"\",(IF(AND(PG!F201=1,PG!F202=1,OR(F44=\"ピアザホール(本番)\", F44=\"ピアザホール(準備)\",F44=\"練習室(一般)\",F44=\"練習室(学生)\")),PG!M199, PG!K199)))","v":""},null,null,null,null,{"$f":"IF(PG!L199=0,\"\",(IF(AND(PG!F201=1,PG!F202=1,OR(F44=\"ピアザホール(本番)\", F44=\"ピアザホール(準備)\",F44=\"練習室(一般)\",F44=\"練習室(学生)\")),PG!M199, PG!L199)))","v":""},null,null,null,null,{"$f":"IF(SUM(M44:AF45)=0,\"\",SUM(M44:AF45))","v":""}]
[]
[null,null,null,null,null,null,null,null,null,null,null,null,{"$f":"IF(PG!I203=0, \"\", PG!I203)","v":""},null,null,null,null,{"$f":"IF(PG!J203=0, \"\", PG!J203)","v":""},null,null,null,null,{"$f":"IF(PG!K203=0,\"\",(IF(AND(PG!F205=1,PG!F206=1,OR(F46=\"ピアザホール(本番)\", F46=\"ピアザホール(準備)\",F46=\"練習室(一般)\",F46=\"練習室(学生)\")),PG!M203, PG!K203)))","v":""},null,null,null,null,{"$f":"IF(PG!L203=0,\"\",(IF(AND(PG!F205=1,PG!F206=1,OR(F46=\"ピアザホール(本番)\", F46=\"ピアザホール(準備)\",F46=\"練習室(一般)\",F46=\"練習室(学生)\")),PG!M203, PG!L203)))","v":""},null,null,null,null,{"$f":"IF(SUM(M46:AF47)=0,\"\",SUM(M46:AF47))","v":""}]
[]
[null,null,null,null,null,null,null,null,null,null,null,null,{"$f":"IF(PG!I207=0, \"\", PG!I207)","v":""},null,null,null,null,{"$f":"IF(PG!J207=0, \"\", PG!J207)","v":""},null,null,null,null,{"$f":"IF(PG!K207=0,\"\",(IF(AND(PG!F209=1,PG!F210=1,OR(F48=\"ピアザホール(本番)\", F48=\"ピアザホール(準備)\",F48=\"練習室(一般)\",F48=\"練習室(学生)\")),PG!M207, PG!K207)))","v":""},null,null,null,null,{"$f":"IF(PG!L207=0,\"\",(IF(AND(PG!F209=1,PG!F210=1,OR(F48=\"ピアザホール(本番)\", F48=\"ピアザホール(準備)\",F48=\"練習室(一般)\",F48=\"練習室(学生)\")),PG!M207, PG!L207)))","v":""},null,null,null,null,{"$f":"IF(SUM(M48:AF49)=0,\"\",SUM(M48:AF49))","v":""}]
[]
[null,null,null,null,null,null,null,null,null,null,null,null,{"$f":"IF(PG!I211=0, \"\", PG!I211)","v":""},null,null,null,null,{"$f":"IF(PG!J211=0, \"\", PG!J211)","v":""},null,null,null,null,{"$f":"IF(PG!K211=0,\"\",(IF(AND(PG!F213=1,PG!F214=1,OR(F50=\"ピアザホール(本番)\", F50=\"ピアザホール(準備)\",F50=\"練習室(一般)\",F50=\"練習室(学生)\")),PG!M211, PG!K211)))","v":""},null,null,null,null,{"$f":"IF(PG!L211=0,\"\",(IF(AND(PG!F213=1,PG!F214=1,OR(F50=\"ピアザホール(本番)\", F50=\"ピアザホール(準備)\",F50=\"練習室(一般)\",F50=\"練習室(学生)\")),PG!M211, PG!L211)))","v":""},null,null,null,null,{"$f":"IF(SUM(M50:AF51)=0,\"\",SUM(M50:AF51))","v":""}]
[]
[null,null,null,null,null,null,null,null,null,null,null,null,{"$f":"IF(PG!I215=0, \"\", PG!I215)","v":""},null,null,null,null,{"$f":"IF(PG!J215=0, \"\", PG!J215)","v":""},null,null,null,null,{"$f":"IF(PG!K215=0,\"\",(IF(AND(PG!F217=1,PG!F218=1,OR(F52=\"ピアザホール(本番)\", F52=\"ピアザホール(準備)\",F52=\"練習室(一般)\",F52=\"練習室(学生)\")),PG!M215, PG!K215)))","v":""},null,null,null,null,{"$f":"IF(PG!L215=0,\"\",(IF(AND(PG!F217=1,PG!F218=1,OR(F52=\"ピアザホール(本番)\", F52=\"ピアザホール(準備)\",F52=\"練習室(一般)\",F52=\"練習室(学生)\")),PG!M215, PG!L215)))","v":""},null,null,null,null,{"$f":"IF(SUM(M52:AF53)=0,\"\",SUM(M52:AF53))","v":""}]
[]
[null,null,null,null,null,null,null,null,null,null,null,null,{"$f":"IF(PG!I219=0, \"\", PG!I219)","v":""},null,null,null,null,{"$f":"IF(PG!J219=0, \"\", PG!J219)","v":""},null,null,null,null,{"$f":"IF(PG!K219=0,\"\",(IF(AND(PG!F221=1,PG!F222=1,OR(F54=\"ピアザホール(本番)\", F54=\"ピアザホール(準備)\",F54=\"練習室(一般)\",F54=\"練習室(学生)\")),PG!M219, PG!K219)))","v":""},null,null,null,null,{"$f":"IF(PG!L219=0,\"\",(IF(AND(PG!F221=1,PG!F222=1,OR(F54=\"ピアザホール(本番)\", F54=\"ピアザホール(準備)\",F54=\"練習室(一般)\",F54=\"練習室(学生)\")),PG!M219, PG!L219)))","v":""},null,null,null,null,{"$f":"IF(SUM(M54:AF55)=0,\"\",SUM(M54:AF55))","v":""}]
[]
[null,null,null,null,null,null,null,null,null,null,null,null,null,null,null,null,null,null,null,null,null,null,null,null,null,null,null,{"$f":"SUM(AG10:AL55)","v":0},null,null,null,null,null,null,null,null,null,null,"承認印"]
[]
[]
[]
[]
[null,null,null,null,null,null,null,null,null,null,null,null,null,null,null,null,null,null,null,null,null,"受付",null,null,"台帳記入"]
[null,null,null,null,null,null,null,null,null,null,null,null,null,null,null,null,null,null,null,null,null,null,null,null,null,null,null,null,null,null,null,null,null,"上記の通り利用を承認します。"]
[null,null,null,null,null,null,null,null,null,null,null,null,null,null,null,null,null,null,null,null,null,null,null,null,null,null,null,null,null,null,null,null,null,"印のないものは無効です。"]
[]
[null,null,null,null,null,null,null,null,null,null,null,null,null,null,null,null,null,null,null,null,null,null,null,null,"  滋賀県立県民交流センター"]
[null,null,null,null,null,null,null,null,null,null,null,null,null,null,null,null,null,null,null,null,null,null,null,null," 指定管理者　 株式会社コンベンションリンケージ",null,null,null,null,null,null,null,null,null,null,null,null,null,null,null,null,null,null,{"$f":"#REF!*10000+#REF!*1000+#REF!*100+#REF!*10+#REF!","v":{"$error":"#REF!"}},{"$f":"#REF!*10000+#REF!*1000+#REF!*100+#REF!*10+#REF!","v":{"$error":"#REF!"}},{"$f":"#REF!*10000+#REF!*1000+#REF!*100+#REF!*10+#REF!","v":{"$error":"#REF!"}},{"$f":"SUM(AR66:AT66)","v":{"$error":"#REF!"}}]
[null,null,null,null,null,null,null,null,null,null,null,null,null,null,null,null,null,null,null,null,null,null,null,null,null,null,null,null,null,null,null,null,null,null,null,null,null,null,null,null,null,null,null,{"$f":"#REF!*10000+#REF!*1000+#REF!*100+#REF!*10+#REF!","v":{"$error":"#REF!"}},{"$f":"#REF!*10000+#REF!*1000+#REF!*100+#REF!*10+#REF!","v":{"$error":"#REF!"}},{"$f":"#REF!*10000+#REF!*1000+#REF!*100+#REF!*10+#REF!","v":{"$error":"#REF!"}},{"$f":"SUM(AR67:AT67)","v":{"$error":"#REF!"}}]
[null,null,null,null,null,null,null,null,null,null,null,null,null,null,null,null,null,null,null,null,null,null,null,null,null,null,null,null,null,null,null,null,null,null,null,null,null,null,null,null,null,null,null,{"$f":"#REF!*10000+#REF!*1000+#REF!*100+#REF!*10+#REF!","v":{"$error":"#REF!"}},{"$f":"#REF!*10000+#REF!*1000+#REF!*100+#REF!*10+#REF!","v":{"$error":"#REF!"}},{"$f":"#REF!*10000+#REF!*1000+#REF!*100+#REF!*10+#REF!","v":{"$error":"#REF!"}},{"$f":"SUM(AR68:AT68)","v":{"$error":"#REF!"}}]
[null,null,null,null,null,null,null,null,null,null,null,null,null,null,null,null,null,null,null,null,null,null,null,null,null,null,null,null,null,null,null,null,null,null,null,null,null,null,null,null,null,null,null,{"$f":"#REF!*10000+#REF!*1000+#REF!*100+#REF!*10+#REF!","v":{"$error":"#REF!"}},{"$f":"#REF!*10000+#REF!*1000+#REF!*100+#REF!*10+#REF!","v":{"$error":"#REF!"}},{"$f":"#REF!*10000+#REF!*1000+#REF!*100+#REF!*10+#REF!","v":{"$error":"#REF!"}},{"$f":"SUM(AR69:AT69)","v":{"$error":"#REF!"}}]
[null,null,null,null,null,null,null,null,null,null,null,null,null,null,null,null,null,null,null,null,null,null,null,null,null,null,null,null,null,null,null,null,null,null,null,null,null,null,null,null,null,null,null,{"$f":"#REF!*10000+#REF!*1000+#REF!*100+#REF!*10+#REF!","v":{"$error":"#REF!"}},{"$f":"#REF!*10000+#REF!*1000+#REF!*100+#REF!*10+#REF!","v":{"$error":"#REF!"}},{"$f":"#REF!*10000+#REF!*1000+#REF!*100+#REF!*10+#REF!","v":{"$error":"#REF!"}},{"$f":"SUM(AR70:AT70)","v":{"$error":"#REF!"}}]
[null,null,null,null,null,null,null,null,null,null,null,null,null,null,null,null,null,null,null,null,null,null,null,null,null,null,null,null,null,null,null,null,null,null,null,null,null,null,null,null,null,null,null,null,null,null,{"$f":"SUM(AU66:AU70)","v":{"$error":"#REF!"}}]

{"sheet":"DATA","index":3,"n_rows":151,"n_cols":64,"rows_kept":151,"cut":false,"hidden":true,"merged":[]}
[null,"8：00-9：00",1,2,3,4,5,6,7,8,9,10,11,12,null,null,null,null,null,null,null,"振替休館日",null,null,null,null,"所在",null,"利用区分",null,null,"時間","分",null,null,null,null,1,2,3,null,null,null,null,null,null,1,null,null,2,null,null,3,null,null,4,null,null,5,null,null,6]
[null,null,"県内・無料","県内・3割","県内・5割","県外・無料","県外・3割","県外・5割","休日","休日","休日","休日","休日","休日",null,null,2023,2024,2025,2022,null,2023,2024,2025,2022,"県内","大津",null,1,"国",null,8,"00",null,"事後払い","〇","ピアザホール(本番)",null,"参加費3割加算含む","参加費5割加算含む",null,null,null,null,null,null,"本番","本番","本番","準備","本番","本番","準備","本番","準備",1,"準備","本番","準備","本番","本番","準備","本番","準備"]
[101,"ピアザホール(本番)",7100,{"$f":"C3*1.3","v":9230},{"$f":"C3*1.5","v":10650},{"$f":"C3*1.5","v":10650},{"$f":"C3*1.5+C3*0.3","v":12780},{"$f":"C3*1.5+C3*0.5","v":14200},10600,{"$f":"I3*1.3","v":13780},{"$f":"I3*1.5","v":15900},{"$f":"I3*1.5","v":15900},{"$f":"I3*1.5+I3*0.3","v":19080},{"$f":"I3*1.5+I3*0.5","v":21200},101,"元日","2023-01-01","2024-01-01","2025-01-01","2022-01-10",null,"2023-01-02","2024-02-13","2025-01-14","2022-01-11",null,"草津",null,2,"県",null,9,10,null,"事後払い申請済","◎","ピアザホール(準備)",null,"参加費3割加算含む","参加費5割加算含む",null,null,null,null,null,null,"午前","午後","夜間","午前","午後","夜間","午前","午後","夜間",null,"午後","夜間","午前","午後","夜間","午前","午後","夜間"]
[102,"ピアザホール(準備)",3500,{"$f":"C4*1.3","v":4550},{"$f":"C4*1.5","v":5250},5250,{"$f":"C4*1.5+C4*0.3","v":6300},{"$f":"C4*1.5+C4*0.5","v":7000},5300,{"$f":"I4*1.3","v":6890},{"$f":"I4*1.5","v":7950},{"$f":"I4*1.5","v":7950},{"$f":"I4*1.5+I4*0.3","v":9540},{"$f":"I4*1.5+I4*0.5","v":10600},102,"成人の日","2023-01-09","2024-01-08","2025-01-13","2022-02-23",null,"2023-01-10","2024-05-02","2025-02-25","2022-03-22",null,"守山",null,3,"市町村",null,10,20,null,"要確認","※","大会議室(本番)",null,"参加費3割加算含む","参加費5割加算含む",null,null,null,null,null,"ピアザホール(本番)",1,1,1,0,1,1,0,1,0,null,0,1]
[208,"大会議室(本番)",10900,{"$f":"C5*1.3","v":14170},{"$f":"C5*1.5","v":16350},16350,{"$f":"C5*1.5+C5*0.3","v":19620},{"$f":"C5*1.5+C5*0.5","v":21800},10900,{"$f":"I5*1.3","v":14170},{"$f":"I5*1.5","v":16350},{"$f":"I5*1.5","v":16350},{"$f":"I5*1.5+I5*0.3","v":19620},{"$f":"I5*1.5+I5*0.5","v":21800},208,"建国記念の日","2023-02-11","2024-02-11","2025-02-11","2022-03-21",null,null,"2024-05-07",null,"2022-07-19",null,"近江八幡",null,4,"福祉医療",null,11,30,null,"請求書発行","☆","大会議室(準備)",null,"参加費3割加算含む","参加費5割加算含む",null,null,null,null,null,"ピアザホール(準備)",0,0,0,1,0,0,1,0,1,null,1,0]
[209,"大会議室(準備)",5400,{"$f":"C6*1.3","v":7020},{"$f":"C6*1.5","v":8100},8100,{"$f":"C6*1.5+C6*0.3","v":9720},{"$f":"C6*1.5+C6*0.5","v":10800},5400,{"$f":"I6*1.3","v":7020},{"$f":"I6*1.5","v":8100},8100,{"$f":"I6*1.5+I6*0.3","v":9720},{"$f":"I6*1.5+I6*0.5","v":10800},209,"春分の日","2023-03-21","2024-03-20","2025-03-20","2022-02-11",null,"2023-07-18","2024-07-16",null,"2022-09-20",null,"東近江",null,5,"環境",null,12,40,null,"見積書発行","★",201,null,null,"\"\"",null,null,null,null,null,"大会議室(本番)",1,1,1,0,1,1,0,1,0,null,0,1]
[201,"201会議室",860,860,860,1290,{"$f":"D7*1.5","v":1290},{"$f":"E7*1.5","v":1290},860,860,860,1290,{"$f":"J7*1.5","v":1290},{"$f":"K7*1.5","v":1290},201,"昭和の日","2023-04-29","2024-04-29","2025-04-29","2022-04-29",null,"2023-09-19","2024-08-13",null,"2022-10-11",null,"野洲",null,6,"産業経済",null,13,50,null,"未発行","※",202,null,null,null,null,null,null,null,null,"大会議室(準備)",0,0,0,1,0,0,1,0,1,null,1,0]
[202,"202会議室",860,860,860,1290,1290,1290,860,860,860,1290,1290,1290,202,null,null,"2024-02-12",null,"2022-05-03",null,"2023-10-10","2024-09-17",null,null,null,"彦根",null,7,"労働",null,14,null,null,null,null,203,null,null,null,null,null,null,null,null,"201会議室",24,24,24,3,24,24,3,24,3,null,3,24]
[203,"203会議室",1600,1600,1600,2400,2400,2400,1600,1600,1600,2400,2400,2400,203,null,null,"2024-02-23",null,"2022-05-04",null,null,"2024-09-24",null,null,null,"長浜",null,8,"教育",null,15,null,null,null,null,204,null,null,null,null,null,null,null,null,"202会議室",24,24,24,3,24,24,3,24,3,null,3,24]
[204,"204会議室",1600,1600,1600,2400,2400,2400,1600,1600,1600,2400,2400,2400,204,null,null,"2024-09-23",null,"2022-05-05",null,null,"2024-10-15",null,null,null,"米原",null,9,"学術",null,16,null,null,null,null,205,null,null,null,null,null,null,null,null,"203会議室",48,48,48,3,48,48,3,48,3,null,3,48]
[205,"205会議室",1100,1100,1100,{"$f":"C11*1.5","v":1650},1650,1650,1100,1100,1100,{"$f":"I11*1.5","v":1650},1650,1650,205,"憲法記念日",null,"2024-05-03","2025-05-03","2022-07-18",null,null,"2024-11-05",null,null,null,"高島",null,10,"文化芸術\n生涯学習",null,17,null,null,null,null,206,null,null,null,null,null,null,null,null,"204会議室",48,48,48,3,48,48,3,48,3,null,3,48]
[206,"206会議室",1100,1100,1100,1650,1650,1650,1100,1100,1100,1650,1650,1650,206,"みどりの日","2023-05-04","2024-05-04","2025-05-04","2022-08-11",null,null,null,null,null,null,"栗東",null,11,null,null,18,null,null,null,null,207,null,null,null,null,null,null,null,null,"205会議室",36,36,36,3,36,36,3,36,3,null,3,36]
[207,"207会議室",2300,2300,2300,3450,3450,3450,2300,2300,2300,3450,3450,3450,207,"こどもの日","2023-05-05","2024-05-05","2025-05-05","2022-09-19",null,null,null,null,null,null,"湖南",null,12,"地方自治",null,19,null,null,null,null,301,null,null,null,null,null,null,null,null,"206会議室",36,36,36,3,36,36,3,36,3,null,3,36]
[301,"301会議室",1100,1100,1100,1650,1650,1650,1100,1100,1100,1650,1650,1650,301,"振替休日","2023-02-23","2024-05-06","2025-05-06","2022-09-23",null,null,null,null,null,null,"甲賀",null,13,null,null,20,null,null,null,null,302,null,null,null,null,null,null,null,null,"207会議室",81,81,81,3,81,81,3,81,3,null,3,81]
[302,"302会議室",1100,1100,1100,1650,1650,1650,1100,1100,1100,1650,1650,1650,302,"海の日","2023-08-11","2024-08-11","2025-07-21","2022-10-10",null,null,null,null,null,null,"竜王",null,14,"企業",null,21,null,null,null,null,303,null,null,null,null,null,null,null,null,"301会議室",30,30,30,3,30,30,3,30,3,null,3,30]
[303,"303会議室",1100,1100,1100,1650,1650,1650,1100,1100,1100,1650,1650,1650,303,"山の日","2023-07-17","2024-07-15","2025-08-11","2022-11-03",null,null,null,null,null,null,"愛荘",null,null,null,null,22,null,null,null,null,304,null,null,null,null,null,null,null,null,"302会議室",36,36,36,3,36,36,3,36,3,null,3,36]
[304,"304会議室",1100,1100,1100,{"$f":"C17*1.5","v":1650},1650,1650,1100,1100,1100,{"$f":"I17*1.5","v":1650},1650,1650,304,"振替休日",null,"2024-08-12",null,"2022-11-23",null,null,null,null,null,null,"豊里",null,null,null,null,null,null,null,null,null,305,null,null,null,null,null,null,null,null,"303会議室",36,36,36,3,36,36,3,36,3,null,3,36]
[305,"305会議室",2800,2800,2800,4200,4200,4200,2800,2800,2800,4200,4200,4200,305,"敬老の日","2023-09-18","2024-09-16","2025-09-15",null,null,null,null,null,null,null,"甲良",null,null,null,null,null,null,null,null,null,"特別会議室",null,null,null,null,null,null,null,null,"304会議室",36,36,36,3,36,36,3,36,3,null,3,36]
[306,"特別会議室",1400,1400,1400,2100,2100,2100,1400,1400,1400,2100,2100,2100,306,"秋分の日","2023-09-23","2024-09-23","2025-09-23",null,null,null,null,null,null,null,"多賀",null,null,null,null,null,null,null,null,null,"応接室",null,null,null,null,null,null,null,null,"305会議室",72,72,72,3,72,72,3,72,3,null,3,72]
[307,"応接室",1100,1100,1100,1650,1650,1650,1100,1100,1100,1650,1650,1650,307,"体育の日","2023-10-09","2024-10-14","2025-10-13",null,null,null,null,null,null,null,"日野",null,null,null,null,null,null,null,null,null,"和室",null,null,null,null,null,null,null,null,"特別会議室",20,20,20,3,20,20,3,20,3,null,3,20]
[308,"和室",860,860,860,1290,1290,1290,860,860,860,1290,1290,1290,308,"文化の日","2023-11-03","2024-11-03","2025-11-03",null,null,null,null,null,null,null,"京都",null,null,null,null,null,null,null,null,null,"茶室",null,null,null,null,null,null,null,null,"応接室",14,14,14,3,14,14,3,14,3,null,3,14]
[309,"茶室",1000,1000,1000,1500,1500,1500,1000,1000,1000,1500,1500,1500,309,"振替休日",null,"2024-11-04","2025-11-24",null,null,null,null,null,null,null,"大阪",null,null,null,null,null,null,null,null,null,"練習室(一般)",null,null,null,null,null,null,null,null,"和室",12,12,12,3,12,12,3,12,3,null,3,12]
[310,"練習室(一般)",1100,1100,1100,1650,1650,1650,1100,1100,1100,1650,1650,1650,310,"勤労感謝の日","2023-11-23","2024-11-23","2025-11-23",null,null,null,null,null,null,null,"神戸",null,null,null,null,null,null,null,null,null,"練習室(学生)",null,null,null,null,null,null,null,null,"茶室",6,6,6,3,6,6,3,6,3,null,3,6]
[311,"練習室(学生)",750,750,750,{"$f":"C24*1.5","v":1125},{"$f":"D24*1.5","v":1125},{"$f":"E24*1.5","v":1125},750,750,750,{"$f":"I24*1.5","v":1125},{"$f":"J24*1.5","v":1125},{"$f":"K24*1.5","v":1125},311,null,null,null,null,null,null,null,null,null,null,null,"奈良",null,null,null,null,null,null,null,null,null,"C",null,null,null,null,null,null,null,null,"練習室(一般)",10,10,10,3,10,10,3,10,3,null,3,10]
[null,0,0,0,0,0,0,0,0,0,0,0,0,0,null,null,null,null,null,null,null,null,null,null,null,null,"和歌山",null,null,null,null,null,null,null,null,null,null,null,null,null,null,null,null,null,null,"練習室(学生)",10,10,10,3,10,10,3,10,3,null,3,10]
[null,"9：00-12：00",1,2,3,4,5,6,7,8,9,10,11,12,null,null,null,null,null,null,null,null,null,null,null,null,"東京"]
[null,"会議室","県内・無料","県内・3割","県内・5割","県外・無料","県外・3割","県外・5割","休日","休日","休日","休日","休日","休日",null,"定員の7掛け",null,null,null,null,null,null,null,null,null,null,"三重"]
[101,"ピアザホール(本番)",21400,{"$f":"C28*1.3","v":27820},{"$f":"C28*1.5","v":32100},{"$f":"C28*1.5","v":32100},{"$f":"C28*1.5+C28*0.3","v":38520},{"$f":"C28*1.5+C28*0.5","v":42800},32000,{"$f":"I28*1.3","v":41600},{"$f":"I28*1.5","v":48000},{"$f":"I28*1.5","v":48000},{"$f":"I28*1.5+I28*0.3","v":57600},{"$f":"I28*1.5+I28*0.5","v":64000},"ピアザH(本）",{"$f":"Q28*0.7","v":296.09999999999997},423,null,null,null,null,null,null,null,null,null,"愛知"]
[102,"ピアザホール(準備)",10700,{"$f":"C29*1.3","v":13910},{"$f":"C29*1.5","v":16050},{"$f":"C29*1.5","v":16050},{"$f":"C29*1.5+C29*0.3","v":19260},{"$f":"C29*1.5+C29*0.5","v":21400},16000,{"$f":"I29*1.3","v":20800},{"$f":"I29*1.5","v":24000},{"$f":"I29*1.5","v":24000},{"$f":"I29*1.5+I29*0.3","v":28800},{"$f":"I29*1.5+I29*0.5","v":32000},"ピアザH(準)",{"$f":"Q29*0.7","v":4.8999999999999995},7,null,null,null,null,null,null,null,null,null,"静岡"]
[208,"大会議室(本番)",32800,{"$f":"C30*1.3","v":42640},{"$f":"C30*1.5","v":49200},49200,{"$f":"C30*1.5+C30*0.3","v":59040},{"$f":"C30*1.5+C30*0.5","v":65600},32800,{"$f":"I30*1.3","v":42640},{"$f":"I30*1.5","v":49200},{"$f":"I30*1.5","v":49200},{"$f":"I30*1.5+I30*0.3","v":59040},{"$f":"I30*1.5+I30*0.5","v":65600},"大会議室(本)",151.19999999999999,216,null,null,null,null,null,null,null,null,null,"岡山"]
[209,"大会議室(準備)",16400,{"$f":"C31*1.3","v":21320},{"$f":"C31*1.5","v":24600},24600,{"$f":"C31*1.5+C31*0.3","v":29520},{"$f":"C31*1.5+C31*0.5","v":32800},16400,{"$f":"I31*1.3","v":21320},{"$f":"I31*1.5","v":24600},24600,{"$f":"I31*1.5+I31*0.3","v":29520},{"$f":"I31*1.5+I31*0.5","v":32800},"大会議室(準)",4.8999999999999995,7]
[201,"201会議室",2600,2600,2600,3900,{"$f":"D32*1.5","v":3900},{"$f":"E32*1.5","v":3900},2600,2600,2600,3900,{"$f":"J32*1.5","v":3900},{"$f":"K32*1.5","v":3900},201,16.799999999999997,24]
[202,"202会議室",2600,2600,2600,3900,3900,3900,2600,2600,2600,3900,3900,3900,202,16.799999999999997,24]
[203,"203会議室",4800,4800,4800,7200,7200,7200,4800,4800,4800,7200,7200,7200,203,33.599999999999994,48]
[204,"204会議室",4800,4800,4800,7200,7200,7200,4800,4800,4800,7200,7200,7200,204,33.599999999999994,48]
[205,"205会議室",3300,3300,3300,4950,4950,4950,3300,3300,3300,4950,4950,4950,205,25.2,36]
[206,"206会議室",3300,3300,3300,4950,4950,4950,3300,3300,3300,4950,4950,4950,206,25.2,36]
[207,"207会議室",7000,7000,7000,10500,10500,10500,7000,7000,7000,10500,10500,10500,207,56.699999999999996,81]
[301,"301会議室",3300,3300,3300,4950,4950,4950,3300,3300,3300,4950,4950,4950,301,21,30]
[302,"302会議室",3300,3300,3300,4950,4950,4950,3300,3300,3300,4950,4950,4950,302,25.2,36]
[303,"303会議室",3300,3300,3300,4950,4950,4950,3300,3300,3300,4950,4950,4950,303,25.2,36]
[304,"304会議室",3300,3300,3300,4950,4950,4950,3300,3300,3300,4950,4950,4950,304,25.2,36]
[305,"305会議室",8500,8500,8500,12750,12750,12750,8500,8500,8500,12750,12750,12750,305,50.4,72]
[306,"特別会議室",4300,4300,4300,6450,6450,6450,4300,4300,4300,6450,6450,6450,"特別会議室",14,20]
[307,"応接室",3400,3400,3400,5100,5100,5100,3400,3400,3400,5100,5100,5100,"応接室",9.7999999999999989,14]
[308,"和室",2600,2600,2600,3900,3900,3900,2600,2600,2600,3900,3900,3900,"和室",8.3999999999999986,12]
[309,"茶室",2900,2900,2900,4350,4350,4350,2900,2900,2900,4350,4350,4350,"茶室",5.6,8]
[310,"練習室(一般)",3300,3300,3300,{"$f":"C48*1.5","v":4950},4950,4950,3300,3300,3300,4950,4950,4950,"練習室"]
[311,"練習室(学生)",2400,2400,2400,{"$f":"C49*1.5","v":3600},{"$f":"D49*1.5","v":3600},{"$f":"E49*1.5","v":3600},2400,2400,2400,{"$f":"I49*1.5","v":3600},{"$f":"J49*1.5","v":3600},{"$f":"K49*1.5","v":3600},"練習室(学)"]
[null,0,0,0,0,{"$f":"C50*1.5","v":0},0,0,0,0,0,0,0,0]
[null,"13：00-17：00",1,2,3,4,5,6,7,8,9,10,11,12]
[null,"会議室","県内・無料","県内・3割","県内・5割","県外・無料","県外・3割","県外・5割","休日","休日","休日","休日","休日","休日"]
[null,"ピアザホール(本番)",29000,{"$f":"C53*1.3","v":37700},{"$f":"C53*1.5","v":43500},{"$f":"C53*1.5","v":43500},{"$f":"C53*1.5+C53*0.3","v":52200},{"$f":"C53*1.5+C53*0.5","v":58000},43500,{"$f":"I53*1.3","v":56550},{"$f":"I53*1.5","v":65250},{"$f":"I53*1.5","v":65250},{"$f":"I53*1.5+I53*0.3","v":78300},{"$f":"I53*1.5+I53*0.5","v":87000}]
[null,"ピアザホール(準備)",14500,{"$f":"C54*1.3","v":18850},{"$f":"C54*1.5","v":21750},{"$f":"C54*1.5","v":21750},{"$f":"C54*1.5+C54*0.3","v":26100},{"$f":"C54*1.5+C54*0.5","v":29000},21800,{"$f":"I54*1.3","v":28340},{"$f":"I54*1.5","v":32700},{"$f":"I54*1.5","v":32700},{"$f":"I54*1.5+I54*0.3","v":39240},{"$f":"I54*1.5+I54*0.5","v":43600}]
[null,"大会議室(本番)",43800,{"$f":"C55*1.3","v":56940},{"$f":"C55*1.5","v":65700},65700,{"$f":"C55*1.5+C55*0.3","v":78840},{"$f":"C55*1.5+C55*0.5","v":87600},43800,{"$f":"I55*1.3","v":56940},{"$f":"I55*1.5","v":65700},{"$f":"I55*1.5","v":65700},{"$f":"I55*1.5+I55*0.3","v":78840},{"$f":"I55*1.5+I55*0.5","v":87600}]
[null,"大会議室(準備)",21900,{"$f":"C56*1.3","v":28470},{"$f":"C56*1.5","v":32850},32850,{"$f":"C56*1.5+C56*0.3","v":39420},{"$f":"C56*1.5+C56*0.5","v":43800},21900,{"$f":"I56*1.3","v":28470},{"$f":"I56*1.5","v":32850},32850,{"$f":"I56*1.5+I56*0.3","v":39420},{"$f":"I56*1.5+I56*0.5","v":43800}]
[null,"201会議室",3500,3500,3500,5250,{"$f":"D57*1.5","v":5250},{"$f":"E57*1.5","v":5250},3500,3500,3500,5250,{"$f":"J57*1.5","v":5250},{"$f":"K57*1.5","v":5250}]
[null,"202会議室",3500,3500,3500,5250,5250,5250,3500,3500,3500,5250,5250,5250]
[null,"203会議室",6400,6400,6400,9600,9600,9600,6400,6400,6400,9600,9600,9600]
[null,"204会議室",6400,6400,6400,9600,9600,9600,6400,6400,6400,9600,9600,9600]
[null,"205会議室",4400,4400,4400,6600,6600,6600,4400,4400,4400,6600,6600,6600]
[null,"206会議室",4400,4400,4400,6600,6600,6600,4400,4400,4400,6600,6600,6600]
[null,"207会議室",9400,9400,9400,14100,14100,14100,9400,9400,9400,14100,14100,14100]
[null,"301会議室",4400,4400,4400,6600,6600,6600,4400,4400,4400,6600,6600,6600]
[null,"302会議室",4400,4400,4400,6600,6600,6600,4400,4400,4400,6600,6600,6600]
[null,"303会議室",4400,4400,4400,6600,6600,6600,4400,4400,4400,6600,6600,6600]
[null,"304会議室",4400,4400,4400,6600,6600,6600,4400,4400,4400,6600,6600,6600]
[null,"305会議室",11300,11300,11300,16950,16950,16950,11300,11300,11300,16950,16950,16950]
[null,"特別会議室",5800,5800,5800,8700,8700,8700,5800,5800,5800,8700,8700,8700]
[null,"応接室",4600,4600,4600,6900,6900,6900,4600,4600,4600,6900,6900,6900]
[null,"和室",3500,3500,3500,5250,5250,5250,3500,3500,3500,5250,5250,5250]
[null,"茶室",3900,3900,3900,5850,5850,5850,3900,3900,3900,5850,5850,5850]
[null,"練習室(一般)",4400,4400,4400,{"$f":"C73*1.5","v":6600},6600,6600,4400,4400,4400,6600,6600,6600]
[null,"練習室(学生)",3200,3200,3200,{"$f":"C74*1.5","v":4800},{"$f":"D74*1.5","v":4800},{"$f":"E74*1.5","v":4800},3200,3200,3200,{"$f":"I74*1.5","v":4800},{"$f":"J74*1.5","v":4800},{"$f":"K74*1.5","v":4800}]
[null,0,0,0,0,{"$f":"C75*1.5","v":0},0,0,0,0,0,0,0,0]
[null,"18：00-21：00",1,2,3,4,5,6,7,8,9,10,11,12]
[null,"会議室","県内・無料","県内・3割","県内・5割","県外・無料","県外・3割","県外・5割","休日","休日","休日","休日","休日","休日"]
[null,"ピアザホール(本番)",29000,{"$f":"C78*1.3","v":37700},{"$f":"C78*1.5","v":43500},{"$f":"C78*1.5","v":43500},{"$f":"C78*1.5+C78*0.3","v":52200},{"$f":"C78*1.5+C78*0.5","v":58000},43500,{"$f":"I78*1.3","v":56550},{"$f":"I78*1.5","v":65250},{"$f":"I78*1.5","v":65250},{"$f":"I78*1.5+I78*0.3","v":78300},{"$f":"I78*1.5+I78*0.5","v":87000}]
[null,"ピアザホール(準備)",14500,{"$f":"C79*1.3","v":18850},{"$f":"C79*1.5","v":21750},{"$f":"C79*1.5","v":21750},{"$f":"C79*1.5+C79*0.3","v":26100},{"$f":"C79*1.5+C79*0.5","v":29000},21800,{"$f":"I79*1.3","v":28340},{"$f":"I79*1.5","v":32700},{"$f":"I79*1.5","v":32700},{"$f":"I79*1.5+I79*0.3","v":39240},{"$f":"I79*1.5+I79*0.5","v":43600}]
[null,"大会議室(本番)",32800,{"$f":"C80*1.3","v":42640},{"$f":"C80*1.5","v":49200},49200,{"$f":"C80*1.5+C80*0.3","v":59040},{"$f":"C80*1.5+C80*0.5","v":65600},32800,{"$f":"I80*1.3","v":42640},{"$f":"I80*1.5","v":49200},{"$f":"I80*1.5","v":49200},{"$f":"I80*1.5+I80*0.3","v":59040},{"$f":"I80*1.5+I80*0.5","v":65600}]
[null,"大会議室(準備)",16400,{"$f":"C81*1.3","v":21320},{"$f":"C81*1.5","v":24600},24600,{"$f":"C81*1.5+C81*0.3","v":29520},{"$f":"C81*1.5+C81*0.5","v":32800},16400,{"$f":"I81*1.3","v":21320},{"$f":"I81*1.5","v":24600},24600,{"$f":"I81*1.5+I81*0.3","v":29520},{"$f":"I81*1.5+I81*0.5","v":32800}]
[null,"201会議室",2600,2600,2600,3900,{"$f":"D82*1.5","v":3900},{"$f":"E82*1.5","v":3900},2600,2600,2600,3900,{"$f":"J82*1.5","v":3900},{"$f":"K82*1.5","v":3900}]
[null,"202会議室",2600,2600,2600,3900,3900,3900,2600,2600,2600,3900,3900,3900]
[null,"203会議室",4800,4800,4800,7200,7200,7200,4800,4800,4800,7200,7200,7200]
[null,"204会議室",4800,4800,4800,7200,7200,7200,4800,4800,4800,7200,7200,7200]
[null,"205会議室",3300,3300,3300,4950,4950,4950,3300,3300,3300,4950,4950,4950]
[null,"206会議室",3300,3300,3300,4950,4950,4950,3300,3300,3300,4950,4950,4950]
[null,"207会議室",7000,7000,7000,10500,10500,10500,7000,7000,7000,10500,10500,10500]
[null,"301会議室",3300,3300,3300,4950,4950,4950,3300,3300,3300,4950,4950,4950]
[null,"302会議室",3300,3300,3300,4950,4950,4950,3300,3300,3300,4950,4950,4950]
[null,"303会議室",3300,3300,3300,4950,4950,4950,3300,3300,3300,4950,4950,4950]
[null,"304会議室",3300,3300,3300,4950,4950,4950,3300,3300,3300,4950,4950,4950]
[null,"305会議室",8500,8500,8500,12750,12750,12750,8500,8500,8500,12750,12750,12750]
[null,"特別会議室",4300,4300,4300,6450,6450,6450,4300,4300,4300,6450,6450,6450]
[null,"応接室",3400,3400,3400,5100,5100,5100,3400,3400,3400,5100,5100,5100]
[null,"和室",2600,2600,2600,3900,3900,3900,2600,2600,2600,3900,3900,3900]
[null,"茶室",2900,2900,2900,4350,4350,4350,2900,2900,2900,4350,4350,4350]
[null,"練習室(一般)",3300,3300,3300,{"$f":"C98*1.5","v":4950},4950,4950,3300,3300,3300,4950,4950,4950]
[null,"練習室(学生)",2400,2400,2400,{"$f":"C99*1.5","v":3600},{"$f":"D99*1.5","v":3600},{"$f":"E99*1.5","v":3600},2400,2400,2400,{"$f":"I99*1.5","v":3600},{"$f":"J99*1.5","v":3600},{"$f":"K99*1.5","v":3600}]
[null,0,0,0,0,0,0,0,0,0,0,0,0,0]
[null,"午後-夜間",1,2,3,4,5,6,7,8,9,10,11,12]
[null,"会議室","県内・無料","県内・3割","県内・5割","県外・無料","県外・3割","県外・5割","休日","休日","休日","休日","休日","休日"]
[null,"ピアザホール(本番)",26700,{"$f":"C103*1.3","v":34710},{"$f":"C103*1.5","v":40050},{"$f":"C103*1.5","v":40050},{"$f":"C103*1.5+C103*0.3","v":48060},{"$f":"C103*1.5+C103*0.5","v":53400},40000,{"$f":"I103*1.3","v":52000},{"$f":"I103*1.5","v":60000},{"$f":"I103*1.5","v":60000},{"$f":"I103*1.5+I103*0.3","v":72000},{"$f":"I103*1.5+I103*0.5","v":80000}]
[null,"ピアザホール(準備)",13300,{"$f":"C104*1.3","v":17290},{"$f":"C104*1.5","v":19950},{"$f":"C104*1.5","v":19950},{"$f":"C104*1.5+C104*0.3","v":23940},{"$f":"C104*1.5+C104*0.5","v":26600},20000,{"$f":"I104*1.3","v":26000},{"$f":"I104*1.5","v":30000},{"$f":"I104*1.5","v":30000},{"$f":"I104*1.5+I104*0.3","v":36000},{"$f":"I104*1.5+I104*0.5","v":40000}]
[null,"大会議室(本番)",43800,{"$f":"C105*1.3","v":56940},{"$f":"C105*1.5","v":65700},65700,{"$f":"C105*1.5+C105*0.3","v":78840},{"$f":"C105*1.5+C105*0.5","v":87600},43800,{"$f":"I105*1.3","v":56940},{"$f":"I105*1.5","v":65700},{"$f":"I105*1.5","v":65700},{"$f":"I105*1.5+I105*0.3","v":78840},{"$f":"I105*1.5+I105*0.5","v":87600}]
[null,"大会議室(準備)",21900,{"$f":"C106*1.3","v":28470},{"$f":"C106*1.5","v":32850},32850,{"$f":"C106*1.5+C106*0.3","v":39420},{"$f":"C106*1.5+C106*0.5","v":43800},21900,{"$f":"I106*1.3","v":28470},{"$f":"I106*1.5","v":32850},32850,{"$f":"I106*1.5+I106*0.3","v":39420},{"$f":"I106*1.5+I106*0.5","v":43800}]
[null,"201会議室",3500,3500,3500,5250,{"$f":"D107*1.5","v":5250},{"$f":"E107*1.5","v":5250},3500,3500,3500,5250,{"$f":"J107*1.5","v":5250},{"$f":"K107*1.5","v":5250}]
[null,"202会議室",3500,3500,3500,5250,5250,5250,3500,3500,3500,5250,5250,5250]
[null,"203会議室",6400,6400,6400,9600,9600,9600,6400,6400,6400,9600,9600,9600]
[null,"204会議室",6400,6400,6400,9600,9600,9600,6400,6400,6400,9600,9600,9600]
[null,"205会議室",4400,4400,4400,6600,6600,6600,4400,4400,4400,6600,6600,6600]
[null,"206会議室",4400,4400,4400,6600,6600,6600,4400,4400,4400,6600,6600,6600]
[null,"207会議室",9400,9400,9400,14100,14100,14100,9400,9400,9400,14100,14100,14100]
[null,"301会議室",4400,4400,4400,6600,6600,6600,4400,4400,4400,6600,6600,6600]
[null,"302会議室",4400,4400,4400,6600,6600,6600,4400,4400,4400,6600,6600,6600]
[null,"303会議室",4400,4400,4400,6600,6600,6600,4400,4400,4400,6600,6600,6600]
[null,"304会議室",4400,4400,4400,6600,6600,6600,4400,4400,4400,6600,6600,6600]
[null,"305会議室",11300,11300,11300,16950,16950,16950,11300,11300,11300,16950,16950,16950]
[null,"特別会議室",5800,5800,5800,8700,8700,8700,5800,5800,5800,8700,8700,8700]
[null,"応接室",4600,4600,4600,6900,6900,6900,4600,4600,4600,6900,6900,6900]
[null,"和室",3500,3500,3500,5250,5250,5250,3500,3500,3500,5250,5250,5250]
[null,"茶室",3900,3900,3900,5850,5850,5850,3900,3900,3900,5850,5850,5850]
[null,"練習室(一般)",3250,3250,3250,{"$f":"C123*1.5","v":4875},4875,4875,3250,3250,3250,{"$f":"I123*1.5","v":4875},4875,4875]
[null,"練習室(学生)",2400,2400,2400,{"$f":"C124*1.5","v":3600},{"$f":"D124*1.5","v":3600},{"$f":"E124*1.5","v":3600},2400,2400,2400,{"$f":"I124*1.5","v":3600},{"$f":"J124*1.5","v":3600},{"$f":"K124*1.5","v":3600}]
[null,0,0,0,0,0,0,0,0,0,0,0,0,0]
[]
[]
[null,null,1,2,3,4,5,6,7,8,9,10,11,12]
[null,null,"県内・無料","県内・3割","県内・5割","県外・無料","県外・3割","県外・5割","県内・無料","県内・3割","県内・5割","県外・無料","県外・3割","県外・5割"]
[101,"ピアザホール(本番)",{"$f":"\"\"","v":""},"参加費③","参加費⑤","県外","県外・参加費③","県外・参加費⑤",{"$f":"\"\"","v":""},"参加費③","参加費⑤","県外","県外・参加費③","県外・参加費⑤"]
[102,"ピアザホール(準備)",{"$f":"\"\"","v":""},"参加費③","参加費⑤","県外","県外・参加費③","県外・参加費⑤",{"$f":"\"\"","v":""},"参加費③","参加費⑤","県外","県外・参加費③","県外・参加費⑤"]
[208,"大会議室(本番)",{"$f":"\"\"","v":""},"参加費③","参加費⑤","県外","県外・参加費③","県外・参加費⑤",{"$f":"\"\"","v":""},"参加費③","参加費⑤","県外","県外・参加費③","県外・参加費⑤"]
[209,"大会議室(準備)",{"$f":"\"\"","v":""},"参加費③","参加費⑤","県外","県外・参加費③","県外・参加費⑤",{"$f":"\"\"","v":""},"参加費③","参加費⑤","県外","県外・参加費③","県外・参加費⑤"]
[201,"201会議室",{"$f":"\"\"","v":""},{"$f":"\"\"","v":""},{"$f":"\"\"","v":""},"県外","県外","県外",{"$f":"\"\"","v":""},{"$f":"\"\"","v":""},{"$f":"\"\"","v":""},"県外","県外","県外"]
[202,"202会議室",{"$f":"\"\"","v":""},{"$f":"\"\"","v":""},{"$f":"\"\"","v":""},"県外","県外","県外",{"$f":"\"\"","v":""},{"$f":"\"\"","v":""},{"$f":"\"\"","v":""},"県外","県外","県外"]
[203,"203会議室",{"$f":"\"\"","v":""},{"$f":"\"\"","v":""},{"$f":"\"\"","v":""},"県外","県外","県外",{"$f":"\"\"","v":""},{"$f":"\"\"","v":""},{"$f":"\"\"","v":""},"県外","県外","県外"]
[204,"204会議室",{"$f":"\"\"","v":""},{"$f":"\"\"","v":""},{"$f":"\"\"","v":""},"県外","県外","県外",{"$f":"\"\"","v":""},{"$f":"\"\"","v":""},{"$f":"\"\"","v":""},"県外","県外","県外"]
[205,"205会議室",{"$f":"\"\"","v":""},{"$f":"\"\"","v":""},{"$f":"\"\"","v":""},"県外","県外","県外",{"$f":"\"\"","v":""},{"$f":"\"\"","v":""},{"$f":"\"\"","v":""},"県外","県外","県外"]
[206,"206会議室",{"$f":"\"\"","v":""},{"$f":"\"\"","v":""},{"$f":"\"\"","v":""},"県外","県外","県外",{"$f":"\"\"","v":""},{"$f":"\"\"","v":""},{"$f":"\"\"","v":""},"県外","県外","県外"]
[207,"207会議室",{"$f":"\"\"","v":""},{"$f":"\"\"","v":""},{"$f":"\"\"","v":""},"県外","県外","県外",{"$f":"\"\"","v":""},{"$f":"\"\"","v":""},{"$f":"\"\"","v":""},"県外","県外","県外"]
[301,"301会議室",{"$f":"\"\"","v":""},{"$f":"\"\"","v":""},{"$f":"\"\"","v":""},"県外","県外","県外",{"$f":"\"\"","v":""},{"$f":"\"\"","v":""},{"$f":"\"\"","v":""},"県外","県外","県外"]
[302,"302会議室",{"$f":"\"\"","v":""},{"$f":"\"\"","v":""},{"$f":"\"\"","v":""},"県外","県外","県外",{"$f":"\"\"","v":""},{"$f":"\"\"","v":""},{"$f":"\"\"","v":""},"県外","県外","県外"]
[303,"303会議室",{"$f":"\"\"","v":""},{"$f":"\"\"","v":""},{"$f":"\"\"","v":""},"県外","県外","県外",{"$f":"\"\"","v":""},{"$f":"\"\"","v":""},{"$f":"\"\"","v":""},"県外","県外","県外"]
[304,"304会議室",{"$f":"\"\"","v":""},{"$f":"\"\"","v":""},{"$f":"\"\"","v":""},"県外","県外","県外",{"$f":"\"\"","v":""},{"$f":"\"\"","v":""},{"$f":"\"\"","v":""},"県外","県外","県外"]
[305,"305会議室",{"$f":"\"\"","v":""},{"$f":"\"\"","v":""},{"$f":"\"\"","v":""},"県外","県外","県外",{"$f":"\"\"","v":""},{"$f":"\"\"","v":""},{"$f":"\"\"","v":""},"県外","県外","県外"]
[306,"特別会議室",{"$f":"\"\"","v":""},{"$f":"\"\"","v":""},{"$f":"\"\"","v":""},"県外","県外","県外",{"$f":"\"\"","v":""},{"$f":"\"\"","v":""},{"$f":"\"\"","v":""},"県外","県外","県外"]
[307,"応接室",{"$f":"\"\"","v":""},{"$f":"\"\"","v":""},{"$f":"\"\"","v":""},"県外","県外","県外",{"$f":"\"\"","v":""},{"$f":"\"\"","v":""},{"$f":"\"\"","v":""},"県外","県外","県外"]
[308,"和室",{"$f":"\"\"","v":""},{"$f":"\"\"","v":""},{"$f":"\"\"","v":""},"県外","県外","県外",{"$f":"\"\"","v":""},{"$f":"\"\"","v":""},{"$f":"\"\"","v":""},"県外","県外","県外"]
[309,"茶室",{"$f":"\"\"","v":""},{"$f":"\"\"","v":""},{"$f":"\"\"","v":""},"県外","県外","県外",{"$f":"\"\"","v":""},{"$f":"\"\"","v":""},{"$f":"\"\"","v":""},"県外","県外","県外"]
[310,"練習室(一般)",{"$f":"\"\"","v":""},{"$f":"\"\"","v":""},{"$f":"\"\"","v":""},"県外","県外","県外",{"$f":"\"\"","v":""},{"$f":"\"\"","v":""},{"$f":"\"\"","v":""},"県外","県外","県外"]
[311,"練習室(学生)",{"$f":"\"\"","v":""},{"$f":"\"\"","v":""},{"$f":"\"\"","v":""},"県外","県外","県外",{"$f":"\"\"","v":""},{"$f":"\"\"","v":""},{"$f":"\"\"","v":""},"県外","県外","県外"]

{"sheet":"Sheet3","index":4,"n_rows":27,"n_cols":13,"rows_kept":27,"cut":false,"hidden":true,"merged":[]}
[null,2019,2020]
["元日","2019-01-01","2020-01-01"]
["成人の日","2019-01-14","2020-01-13",null,null,null,null,43526,2,"ピアザホール(本番)"]
["建国記念の日","2019-02-11","2020-01-11"]
["春分の日","2019-03-21","2020-03-20"]
["昭和の日","2019-04-29","2020-04-29"]
[null,"2019-04-30",null,null,null,null,null,43526,2,201]
[null,"2019-05-01"]
[null,"2019-05-02"]
["憲法記念日","2019-05-03","2020-05-03"]
["みどりの日","2019-05-04","2020-05-04",null,null,null,null,43526,2,201,null,null,{"$f":"IF(AND($H$11=$H$7,$J$11=$J$7),\"重複\",$J$11)","v":"重複"}]
["こどもの日","2019-05-05"]
["振替休日","2019-05-06","2020-05-05"]
["海の日","2019-07-15","2020-07-23"]
["山の日","2019-08-11","2020-08-10",null,null,null,null,43526,2,"ピアザホール(本番)"]
["振替休日","2019-08-12"]
["敬老の日","2019-09-16","2020-09-21"]
["秋分の日","2019-09-23","2020-09-22"]
["体育の日","2019-10-14","2020-07-24",null,null,null,null,43526,2,"大会議室(本番)"]
["文化の日","2019-11-03","2020-11-03"]
["振替休日","2019-11-04"]
["勤労感謝の日","2019-11-23","2020-11-23"]
[null,null,null,null,null,null,null,43528,1,202]
[]
[]
[]
[null,null,null,null,null,null,null,43528,1,201]

{"sheet":"Sheet1","index":5,"n_rows":0,"n_cols":0,"rows_kept":0,"cut":false,"hidden":true,"merged":[]}

{"sheet":"Sheet2","index":6,"n_rows":0,"n_cols":0,"rows_kept":0,"cut":false,"hidden":true,"merged":[]}

{"sheet":"SU","index":7,"n_rows":152,"n_cols":40,"rows_kept":152,"cut":false,"hidden":true,"merged":[]}
[null,null,null,null,null,null,null,null,null,{"$f":"PG!K1","v":false},null,null,null,{"$f":"COUNTIFS(R2:R61,AJ6,S2:S61, \">0\")","v":0},null,null,"所在・分類\nコード","日付け","会議室",null,"午前","午後","夜間","人員A","人員P","人員N","所在A","分類A","所在P","分類P","所在N","分類N",null,null,null,null,{"$f":"MID(AK2,34,(FIND(\"[\",AK2)-35))","v":"plication"}]
[{"$f":"IF(OR(S2<=207,S2=101,S2=102),\"2階\",IF(OR(S2=208,S2=209, S2 =210),\"1階\",\"3階\"))","v":"2階"},{"$f":"IF(T2=0,\"\",VLOOKUP(T2,DATA!$B$28:$O$49,14,FALSE))","v":""},{"$f":"IF(OR(B2=\"ピアザH(準)\",B2=\"大会議室(準)\",B2=\"\"),\"準備(掲示なし)\",利用申込書1!F21)","v":"準備(掲示なし)"},{"$f":"PG!$O$7","v":"夜間"},{"$f":"PG!F7","v":2},null,{"$f":"利用申込書1!$A$27","v":"00:00:00"},{"$f":"VLOOKUP(T2,DATA!$B$2:$O$25,14,FALSE)","v":0},null,{"$f":"利用申込書1!AG27","v":""},{"$f":"VLOOKUP($S2,$B$130:$D$151,3,FALSE)","v":{"$error":"#N/A"}},0,null,null,null,{"$f":"PG!F3","v":2},{"$f":"IF(S2=102,101,IF(S2=209,208,S2))","v":0},{"$f":"PG!V8","v":"1月0日"},{"$f":"VLOOKUP(T2,DATA!$B$2:$O$25,14,FALSE)","v":0},{"$f":"PG!D7","v":0},{"$f":"IF(利用申込書1!M27=\"\",利用申込書1!R27,利用申込書1!R27+利用申込書1!M27)","v":""},{"$f":"利用申込書1!W27","v":""},{"$f":"利用申込書1!AB27","v":""},{"$f":"IF(U2=\"\",0,IF(OR($B2=\"ピアザH(準)\",$B2=\"大会議室(準)\"),7,IF(OR(PG!$I$2<12,PG!$I$2=12),B4,3)))","v":0},{"$f":"IF(V2=\"\",0,IF(OR($B2=\"ピアザH(準)\",$B2=\"大会議室(準)\"),7,IF(OR(PG!$J$2<13,PG!$J$2=13),3,$B4)))","v":0},{"$f":"IF(W2=\"\",0,IF(OR($B2=\"ピアザH(準)\",$B2=\"大会議室(準)\"),7,IF(PG!$J$2<18,3,$B4)))","v":0},{"$f":"IF(AND($P$2=1,U2<>\"\"),利用申込書1!$Z$52,\"\")","v":""},{"$f":"IF(AND($P$2=1,U2<>\"\"),利用申込書1!$AD$52,\"\")","v":""},{"$f":"IF(AND($P$2=1,U2=\"\",V2<>\"\"),利用申込書1!$Z$52,\"\")","v":""},{"$f":"IF(AND($P$2=1, U2=\"\",V2<>\"\"),利用申込書1!$AD$52,\"\")","v":""},{"$f":"IF(AND($P$2=1,U2=\"\",V2=\"\",W2<>\"\"),利用申込書1!$Z$52,\"\")","v":""},{"$f":"IF(AND($P$2=1, U2=\"\",V2=\"\",W2<>\"\"),利用申込書1!$AD$52,\"\")","v":""},{"$f":"S2&\"号室\"","v":"0号室"},null,{"$f":"SUBSTITUTE(SUBSTITUTE(SUBSTITUTE(SUBSTITUTE(SUBSTITUTE(利用申込書1!$K$9,\"一般社団法人\",\"(一社)\"),\"株式会社\",\"㈱\"),\"一般財団法人\",\"(一財)\"),\"社会福祉法人)\",\"(社福\"),\"有限会社\",\"㈲\")","v":""},null,{"$f":"CELL(\"filename\",AK2)","v":"C:\\Users\\user\\Desktop\\web\\data\\application\\[riyou_20240215.xlsm]SU"}]
[null,null,{"$f":"利用申込書1!$AV$48","v":",(0様)"},{"$f":"PG!$Q$7","v":"18:00-21:00"},1,{"$f":"IF(OR(S3=101,S3=102,S3=208,S3=209),\"別紙参照\",\"\")","v":""},{"$f":"利用申込書1!$A$27","v":"00:00:00"},{"$f":"H2","v":0},null,null,null,null,null,null,null,null,{"$f":"Q2+0.3","v":0.3},{"$f":"R2","v":"1月0日"},{"$f":"S2","v":0},null,null,null,null,null,null,null,{"$f":"IF(AND($P$2=2,U2<>\"\"),利用申込書1!$Z$52,\"\")","v":""},{"$f":"IF(AND($P$2=2,U2<>\"\"),利用申込書1!$AD$52,\"\")","v":""},{"$f":"IF(AND($P$2=2,U2=\"\",V2<>\"\"),利用申込書1!$Z$52,\"\")","v":""},{"$f":"IF(AND($P$2=2, U2=\"\",V2<>\"\"),利用申込書1!$AD$52,\"\")","v":""},{"$f":"IF(AND($P$2=2,U2=\"\",V2=\"\",W2<>\"\"),利用申込書1!$Z$52,\"\")","v":""},{"$f":"IF(AND($P$2=2, U2=\"\",V2=\"\",W2<>\"\"),利用申込書1!$AD$52,\"\")","v":""},{"$f":"S3&\"号室\"","v":"0号室"},null,"(",null,null,null,{"$f":"MID(AK2,26,(FIND(\"[\",AK2)-27))","v":"\\data\\application"},{"$f":"LEFT(AM5,5)","v":"dataa"}]
[null,{"$f":"IF(T2=0,\"\",IF(VLOOKUP(T2,DATA!$B$28:$P$49,15,FALSE)>利用申込書1!$Y$23,利用申込書1!$Y$23,VLOOKUP(T2,DATA!$B$28:$P$49,15,FALSE)))","v":""},{"$f":"PG!$H$1","v":"：～："},{"$f":"CHOOSE(PG!H7,VLOOKUP(S2,DATA!$A$129:$N$151,3,FALSE),VLOOKUP(S2,DATA!$A$129:$N$151,4,FALSE),VLOOKUP(S2,DATA!$A$129:$N$151,5,FALSE),VLOOKUP(S2,DATA!$A$129:$N$151,6,FALSE),VLOOKUP(S2,DATA!$A$129:$N$151,7,FALSE),VLOOKUP(S2,DATA!$A$129:$N$151,8,FALSE),VLOOKUP(S2,DATA!$A$129:$N$151,9,FALSE),VLOOKUP(S2,DATA!$A$129:$N$151,10,FALSE),VLOOKUP(S2,DATA!$A$129:$N$151,11,FALSE),VLOOKUP(S2,DATA!$A$129:$N$151,12,FALSE),VLOOKUP(S2,DATA!$A$129:$N$151,13,FALSE),VLOOKUP(S2,DATA!$A$129:$N$151,14,FALSE),\"\")","v":{"$error":"#N/A"}},1,null,{"$f":"利用申込書1!$A$27","v":"00:00:00"},{"$f":"H2","v":0},null,null,null,null,null,null,null,null,null,{"$f":"R2","v":"1月0日"},{"$f":"S2","v":0},{"$f":"利用申込書1!$Y$23","v":0},null,null,null,null,null,null,null,null,null,null,null,null,"0号室",null,{"$f":"利用申込書1!AD12","v":0},null,{"$f":"MID(AK2,34,(FIND(\"[\",AK2)-35))","v":"plication"},null,{"$f":"LEFT(AM5,8)","v":"dataappl"}]
[{"$f":"IF(OR(S5<=207,S5=101,S5=102),\"2階\",IF(OR(S5=208,S5=209, S5 =210),\"1階\",\"3階\"))","v":"2階"},{"$f":"IF(T5=0,\"\",VLOOKUP(T5,DATA!$B$28:$O$49,14,FALSE))","v":""},{"$f":"IF(OR(B5=\"ピアザH(準)\",B5=\"大会議室(準)\"),\"準備(掲示なし)\",利用申込書1!$F$21)","v":0},{"$f":"PG!$O$11","v":"夜間"},{"$f":"PG!F11","v":2},null,{"$f":"IF(利用申込書1!$A$29=\"\",$R$2,利用申込書1!$A$29)","v":"1月0日"},{"$f":"VLOOKUP(T5,DATA!$B$2:$O$25,14,FALSE)","v":0},null,{"$f":"利用申込書1!AG29","v":""},{"$f":"VLOOKUP($S5,$B$130:$D$151,3,FALSE)","v":{"$error":"#N/A"}},0,null,null,null,null,{"$f":"IF(S5=102,101,IF(S5=209,208,S5))","v":0},{"$f":"PG!V12","v":"1月0日"},{"$f":"VLOOKUP(T5,DATA!$B$2:$O$25,14,FALSE)","v":0},{"$f":"PG!D11","v":0},{"$f":"IF(利用申込書1!M29=\"\",利用申込書1!R29,利用申込書1!R29+利用申込書1!M29)","v":""},{"$f":"利用申込書1!W29","v":""},{"$f":"利用申込書1!AB29","v":""},{"$f":"IF(U5=\"\",0,IF(OR($B5=\"ピアザH(準)\",$B5=\"大会議室(準)\"),7,IF(OR(PG!$I$2<12,PG!$I$2=12),B7,3)))","v":0},{"$f":"IF(V5=\"\",0,IF(OR($B5=\"ピアザH(準)\",$B5=\"大会議室(準)\"),7,IF(OR(PG!$J$2<13,PG!$J$2=13),3,$B7)))","v":0},{"$f":"IF(W5=\"\",0,IF(OR($B5=\"ピアザH(準)\",$B5=\"大会議室(準)\"),7,IF(PG!$J$2<18,3,$B7)))","v":0},{"$f":"IF(AND($P$2=1,U5<>\"\"),利用申込書1!$Z$52,\"\")","v":""},{"$f":"IF(AND($P$2=1,U5<>\"\"),利用申込書1!$AD$52,\"\")","v":""},{"$f":"IF(AND($P$2=1,U5=\"\",V5<>\"\"),利用申込書1!$Z$52,\"\")","v":""},{"$f":"IF(AND($P$2=1, U5=\"\",V5<>\"\"),利用申込書1!$AD$52,\"\")","v":""},{"$f":"IF(AND($P$2=1,U5=\"\",V5=\"\",W5<>\"\"),利用申込書1!$Z$52,\"\")","v":""},{"$f":"IF(AND($P$2=1, U5=\"\",V5=\"\",W5<>\"\"),利用申込書1!$AD$52,\"\")","v":""},"0号室",null,"様)",null,{"$f":"SUBSTITUTE(AK4,\"\\\",\"\")","v":"plication"},null,{"$f":"SUBSTITUTE(AM3,\"\\\",\"\")","v":"dataapplication"}]
[null,null,{"$f":"IF(R6=R2,\"同上\",$C$3)","v":"同上"},{"$f":"PG!$Q$11","v":"18:00-21:00"},1,{"$f":"IF(OR(S6=101,S6=102,S6=208,S6=209),\"別紙参照\",\"\")","v":""},{"$f":"IF(利用申込書1!$A$29=\"\",$R$2,利用申込書1!$A$29)","v":"1月0日"},{"$f":"H5","v":0},null,null,null,null,null,null,null,null,{"$f":"Q5+0.3","v":0.3},{"$f":"R5","v":"1月0日"},{"$f":"S5","v":0},null,null,null,null,null,null,null,{"$f":"IF(AND($P$2=2,U5<>\"\"),利用申込書1!$Z$52,\"\")","v":""},{"$f":"IF(AND($P$2=2,U5<>\"\"),利用申込書1!$AD$52,\"\")","v":""},{"$f":"IF(AND($P$2=2,U5=\"\",V5<>\"\"),利用申込書1!$Z$52,\"\")","v":""},{"$f":"IF(AND($P$2=2, U5=\"\",V5<>\"\"),利用申込書1!$AD$52,\"\")","v":""},{"$f":"IF(AND($P$2=2,U5=\"\",V5=\"\",W5<>\"\"),利用申込書1!$Z$52,\"\")","v":""},{"$f":"IF(AND($P$2=2, U5=\"\",V5=\"\",W5<>\"\"),利用申込書1!$AD$52,\"\")","v":""},"0号室",null,null,{"$f":"CONCATENATE(AN3,AK5)","v":"dataaplication"},{"$f":"MONTH(AK5)","v":{"$error":"#VALUE!"}},"月",{"$f":"AK6&AL6","v":{"$error":"#VALUE!"}}]
[null,{"$f":"IF(T5=0,\"\",IF(VLOOKUP(T5,DATA!$B$28:$P$49,15,FALSE)>利用申込書1!$Y$23,利用申込書1!$Y$23,VLOOKUP(T5,DATA!$B$28:$P$49,15,FALSE)))","v":""},{"$f":"PG!$H$1","v":"：～："},{"$f":"CHOOSE(PG!H11,VLOOKUP(S5,DATA!$A$129:$N$151,3,FALSE),VLOOKUP(S5,DATA!$A$129:$N$151,4,FALSE),VLOOKUP(S5,DATA!$A$129:$N$151,5,FALSE),VLOOKUP(S5,DATA!$A$129:$N$151,6,FALSE),VLOOKUP(S5,DATA!$A$129:$N$151,7,FALSE),VLOOKUP(S5,DATA!$A$129:$N$151,8,FALSE),VLOOKUP(S5,DATA!$A$129:$N$151,9,FALSE),VLOOKUP(S5,DATA!$A$129:$N$151,10,FALSE),VLOOKUP(S5,DATA!$A$129:$N$151,11,FALSE),VLOOKUP(S5,DATA!$A$129:$N$151,12,FALSE),VLOOKUP(S5,DATA!$A$129:$N$151,13,FALSE),VLOOKUP(S5,DATA!$A$129:$N$151,14,FALSE),\"\")","v":{"$error":"#N/A"}},1,null,{"$f":"IF(利用申込書1!$A$29=\"\",$R$2,利用申込書1!$A$29)","v":"1月0日"},{"$f":"H5","v":0},null,null,null,null,null,null,null,null,null,{"$f":"R5","v":"1月0日"},{"$f":"S5","v":0},{"$f":"利用申込書1!$Y$23","v":0},null,null,null,null,null,null,null,null,null,null,null,null,{"$f":"S7&\"号室\"","v":"0号室"},null,null,null,{"$f":"DAY(AK5)","v":{"$error":"#VALUE!"}},"日",{"$f":"AK7&AL7","v":{"$error":"#VALUE!"}}]
[{"$f":"IF(OR(S8<=207,S8=101,S8=102),\"2階\",IF(OR(S8=208,S8=209, S8 =210),\"1階\",\"3階\"))","v":"2階"},{"$f":"IF(T8=0,\"\",VLOOKUP(T8,DATA!$B$28:$O$49,14,FALSE))","v":""},{"$f":"IF(OR(B8=\"ピアザH(準)\",B8=\"大会議室(準)\"),\"準備(掲示なし)\",IF(AND(R5=R8, B5<>\"ピアザH(準)\"),\"同上\",利用申込書1!$F$21))","v":"同上"},{"$f":"PG!$O$15","v":"夜間"},{"$f":"PG!F15","v":2},null,{"$f":"IF(利用申込書1!$A$31=\"\",$R$5,利用申込書1!$A$31)","v":"1月0日"},{"$f":"VLOOKUP(T8,DATA!$B$2:$O$25,14,FALSE)","v":0},null,{"$f":"利用申込書1!AG31","v":""},{"$f":"VLOOKUP($S8,$B$130:$D$151,3,FALSE)","v":{"$error":"#N/A"}},0,null,null,null,null,{"$f":"IF(S8=102,101,IF(S8=209,208,S8))","v":0},{"$f":"PG!V16","v":"1月0日"},{"$f":"VLOOKUP(T8,DATA!$B$2:$O$25,14,FALSE)","v":0},{"$f":"PG!D15","v":0},{"$f":"IF(利用申込書1!M31=\"\",利用申込書1!R31,利用申込書1!R31+利用申込書1!M31)","v":""},{"$f":"利用申込書1!W31","v":""},{"$f":"利用申込書1!AB31","v":""},{"$f":"IF(U8=\"\",0,IF(OR($B8=\"ピアザH(準)\",$B8=\"大会議室(準)\"),7,IF(OR(PG!$I$2<12,PG!$I$2=12),B10,3)))","v":0},{"$f":"IF(V8=\"\",0,IF(OR($B8=\"ピアザH(準)\",$B8=\"大会議室(準)\"),7,IF(OR(PG!$J$2<13,PG!$J$2=13),3,$B10)))","v":0},{"$f":"IF(W8=\"\",0,IF(OR($B8=\"ピアザH(準)\",$B8=\"大会議室(準)\"),7,IF(PG!$J$2<18,3,$B10)))","v":0},{"$f":"IF(AND($P$2=1,U8<>\"\"),利用申込書1!$Z$52,\"\")","v":""},{"$f":"IF(AND($P$2=1,U8<>\"\"),利用申込書1!$AD$52,\"\")","v":""},{"$f":"IF(AND($P$2=1,U8=\"\",V8<>\"\"),利用申込書1!$Z$52,\"\")","v":""},{"$f":"IF(AND($P$2=1, U8=\"\",V8<>\"\"),利用申込書1!$AD$52,\"\")","v":""},{"$f":"IF(AND($P$2=1,U8=\"\",V8=\"\",W8<>\"\"),利用申込書1!$Z$52,\"\")","v":""},{"$f":"IF(AND($P$2=1, U8=\"\",V8=\"\",W8<>\"\"),利用申込書1!$AD$52,\"\")","v":""},"0号室"]
[null,null,{"$f":"IF(R9=R5,\"\",$C$3)","v":""},{"$f":"PG!$Q$15","v":"18:00-21:00"},1,{"$f":"IF(OR(S9=101,S9=102,S9=208,S9=209),\"別紙参照\",\"\")","v":""},{"$f":"IF(利用申込書1!$A$31=\"\",$R$5,利用申込書1!$A$31)","v":"1月0日"},{"$f":"H8","v":0},null,null,null,null,null,null,null,null,{"$f":"Q8+0.3","v":0.3},{"$f":"R8","v":"1月0日"},{"$f":"S8","v":0},null,null,null,null,null,null,null,{"$f":"IF(AND($P$2=2,U8<>\"\"),利用申込書1!$Z$52,\"\")","v":""},{"$f":"IF(AND($P$2=2,U8<>\"\"),利用申込書1!$AD$52,\"\")","v":""},{"$f":"IF(AND($P$2=2,U8=\"\",V8<>\"\"),利用申込書1!$Z$52,\"\")","v":""},{"$f":"IF(AND($P$2=2,U8=\"\",V8<>\"\"),利用申込書1!$AD$52,\"\")","v":""},{"$f":"IF(AND($P$2=2,U8=\"\",V8=\"\",W8<>\"\"),利用申込書1!$Z$52,\"\")","v":""},{"$f":"IF(AND($P$2=2, U8=\"\",V8=\"\",W8<>\"\"),利用申込書1!$AD$52,\"\")","v":""},"0号室"]
[null,{"$f":"IF(T8=0,\"\",IF(VLOOKUP(T8,DATA!$B$28:$P$49,15,FALSE)>利用申込書1!$Y$23,利用申込書1!$Y$23,VLOOKUP(T8,DATA!$B$28:$P$49,15,FALSE)))","v":""},{"$f":"PG!$H$1","v":"：～："},{"$f":"CHOOSE(PG!H15,VLOOKUP(S8,DATA!$A$129:$N$151,3,FALSE),VLOOKUP(S8,DATA!$A$129:$N$151,4,FALSE),VLOOKUP(S8,DATA!$A$129:$N$151,5,FALSE),VLOOKUP(S8,DATA!$A$129:$N$151,6,FALSE),VLOOKUP(S8,DATA!$A$129:$N$151,7,FALSE),VLOOKUP(S8,DATA!$A$129:$N$151,8,FALSE),VLOOKUP(S8,DATA!$A$129:$N$151,9,FALSE),VLOOKUP(S8,DATA!$A$129:$N$151,10,FALSE),VLOOKUP(S8,DATA!$A$129:$N$151,11,FALSE),VLOOKUP(S8,DATA!$A$129:$N$151,12,FALSE),VLOOKUP(S8,DATA!$A$129:$N$151,13,FALSE),VLOOKUP(S8,DATA!$A$129:$N$151,14,FALSE),\"\")","v":{"$error":"#N/A"}},1,null,{"$f":"IF(利用申込書1!$A$31=\"\",$R$5,利用申込書1!$A$31)","v":"1月0日"},{"$f":"H8","v":0},null,null,null,null,null,null,null,null,null,{"$f":"R8","v":"1月0日"},{"$f":"S8","v":0},{"$f":"利用申込書1!$Y$23","v":0},null,null,null,null,null,null,null,null,null,null,null,null,"0号室"]
[{"$f":"IF(OR(S11<=207,S11=101,S11=102),\"2階\",IF(OR(S11=208,S11=209, S11 =210),\"1階\",\"3階\"))","v":"2階"},{"$f":"IF(T11=0,\"\",VLOOKUP(T11,DATA!$B$28:$O$49,14,FALSE))","v":""},{"$f":"IF(OR(B11=\"ピアザH(準)\",B11=\"大会議室(準)\"),\"準備(掲示なし)\",IF(AND(R8=R11, B8<>\"ピアザH(準)\"),\"同上\",利用申込書1!$F$21))","v":"同上"},{"$f":"PG!$O$19","v":"夜間"},{"$f":"PG!F19","v":2},null,{"$f":"IF(利用申込書1!$A$33=\"\",$R$8,利用申込書1!$A$33)","v":"1月0日"},{"$f":"VLOOKUP(T11,DATA!$B$2:$O$25,14,FALSE)","v":0},null,{"$f":"利用申込書1!AG33","v":""},{"$f":"VLOOKUP($S11,$B$130:$D$151,3,FALSE)","v":{"$error":"#N/A"}},0,null,null,null,null,{"$f":"IF(S11=102,101,IF(S11=209,208,S11))","v":0},{"$f":"PG!V20","v":"1月0日"},{"$f":"VLOOKUP(T11,DATA!$B$2:$O$25,14,FALSE)","v":0},{"$f":"PG!D19","v":0},{"$f":"IF(利用申込書1!M33=\"\",利用申込書1!R33,利用申込書1!R33+利用申込書1!M33)","v":""},{"$f":"利用申込書1!W33","v":""},{"$f":"利用申込書1!AB33","v":""},{"$f":"IF(U11=\"\",0,IF(OR($B11=\"ピアザH(準)\",$B11=\"大会議室(準)\"),7,IF(OR(PG!$I$2<12,PG!$I$2=12),B13,3)))","v":0},{"$f":"IF(V11=\"\",0,IF(OR($B11=\"ピアザH(準)\",$B11=\"大会議室(準)\"),7,IF(OR(PG!$J$2<13,PG!$J$2=13),3,$B13)))","v":0},{"$f":"IF(W11=\"\",0,IF(OR($B11=\"ピアザH(準)\",$B11=\"大会議室(準)\"),7,IF(PG!$J$2<18,3,$B13)))","v":0},{"$f":"IF(AND($P$2=1,U11<>\"\"),利用申込書1!$Z$52,\"\")","v":""},{"$f":"IF(AND($P$2=1,U11<>\"\"),利用申込書1!$AD$52,\"\")","v":""},{"$f":"IF(AND($P$2=1,U11=\"\",V11<>\"\"),利用申込書1!$Z$52,\"\")","v":""},{"$f":"IF(AND($P$2=1, U11=\"\",V11<>\"\"),利用申込書1!$AD$52,\"\")","v":""},{"$f":"IF(AND($P$2=1,U11=\"\",V11=\"\",W11<>\"\"),利用申込書1!$Z$52,\"\")","v":""},{"$f":"IF(AND($P$2=1, U11=\"\",V11=\"\",W11<>\"\"),利用申込書1!$AD$52,\"\")","v":""},"0号室"]
[null,null,{"$f":"IF(R12=R8,\"\",$C$3)","v":""},{"$f":"PG!$Q$19","v":"18:00-21:00"},1,{"$f":"IF(OR(S12=101,S12=102,S12=208,S12=209),\"別紙参照\",\"\")","v":""},{"$f":"IF(利用申込書1!$A$33=\"\",$R$8,利用申込書1!$A$33)","v":"1月0日"},{"$f":"H11","v":0},null,null,null,null,null,null,null,null,{"$f":"Q11+0.3","v":0.3},{"$f":"R11","v":"1月0日"},{"$f":"S11","v":0},null,null,null,null,null,null,null,{"$f":"IF(AND($P$2=2,U11<>\"\"),利用申込書1!$Z$52,\"\")","v":""},{"$f":"IF(AND($P$2=2,U11<>\"\"),利用申込書1!$AD$52,\"\")","v":""},{"$f":"IF(AND($P$2=2,U11=\"\",V11<>\"\"),利用申込書1!$Z$52,\"\")","v":""},{"$f":"IF(AND($P$2=2,U11=\"\",V11<>\"\"),利用申込書1!$AD$52,\"\")","v":""},{"$f":"IF(AND($P$2=2,U11=\"\",V11=\"\",W11<>\"\"),利用申込書1!$Z$52,\"\")","v":""},{"$f":"IF(AND($P$2=2, U11=\"\",V11=\"\",W11<>\"\"),利用申込書1!$AD$52,\"\")","v":""},"0号室"]
[null,{"$f":"IF(T11=0,\"\",IF(VLOOKUP(T11,DATA!$B$28:$P$49,15,FALSE)>利用申込書1!$Y$23,利用申込書1!$Y$23,VLOOKUP(T11,DATA!$B$28:$P$49,15,FALSE)))","v":""},{"$f":"PG!$H$1","v":"：～："},{"$f":"CHOOSE(PG!H19,VLOOKUP(S11,DATA!$A$129:$N$151,3,FALSE),VLOOKUP(S11,DATA!$A$129:$N$151,4,FALSE),VLOOKUP(S11,DATA!$A$129:$N$151,5,FALSE),VLOOKUP(S11,DATA!$A$129:$N$151,6,FALSE),VLOOKUP(S11,DATA!$A$129:$N$151,7,FALSE),VLOOKUP(S11,DATA!$A$129:$N$151,8,FALSE),VLOOKUP(S11,DATA!$A$129:$N$151,9,FALSE),VLOOKUP(S11,DATA!$A$129:$N$151,10,FALSE),VLOOKUP(S11,DATA!$A$129:$N$151,11,FALSE),VLOOKUP(S11,DATA!$A$129:$N$151,12,FALSE),VLOOKUP(S11,DATA!$A$129:$N$151,13,FALSE),VLOOKUP(S11,DATA!$A$129:$N$151,14,FALSE),\"\")","v":{"$error":"#N/A"}},1,null,{"$f":"IF(利用申込書1!$A$33=\"\",$R$8,利用申込書1!$A$33)","v":"1月0日"},{"$f":"H11","v":0},null,null,null,null,null,null,null,null,null,{"$f":"R11","v":"1月0日"},{"$f":"S11","v":0},{"$f":"利用申込書1!$Y$23","v":0},null,null,null,null,null,null,null,null,null,null,null,null,"0号室"]
[{"$f":"IF(OR(S14<=207,S14=101,S14=102),\"2階\",IF(OR(S14=208,S14=209, S14 =210),\"1階\",\"3階\"))","v":"2階"},{"$f":"IF(T14=0,\"\",VLOOKUP(T14,DATA!$B$28:$O$49,14,FALSE))","v":""},{"$f":"IF(OR(B14=\"ピアザH(準)\",B14=\"大会議室(準)\"),\"準備(掲示なし)\",IF(AND(R11=R14, B11<>\"ピアザH(準)\"),\"同上\",利用申込書1!$F$21))","v":"同上"},{"$f":"PG!$O$23","v":"夜間"},{"$f":"PG!F23","v":2},null,{"$f":"IF(利用申込書1!$A$35=\"\",$R$11,利用申込書1!$A$35)","v":"1月0日"},{"$f":"VLOOKUP(T14,DATA!$B$2:$O$25,14,FALSE)","v":0},null,{"$f":"利用申込書1!AG35","v":""},{"$f":"VLOOKUP($S14,$B$130:$D$151,3,FALSE)","v":{"$error":"#N/A"}},0,null,null,null,null,{"$f":"IF(S14=102,101,IF(S14=209,208,S14))","v":0},{"$f":"PG!V24","v":"1月0日"},{"$f":"VLOOKUP(T14,DATA!$B$2:$O$25,14,FALSE)","v":0},{"$f":"PG!D23","v":0},{"$f":"IF(利用申込書1!M35=\"\",利用申込書1!R35,利用申込書1!R35+利用申込書1!M35)","v":""},{"$f":"利用申込書1!W35","v":""},{"$f":"利用申込書1!AB35","v":""},{"$f":"IF(U14=\"\",0,IF(OR($B14=\"ピアザH(準)\",$B14=\"大会議室(準)\"),7,IF(OR(PG!$I$2<12,PG!$I$2=12),B16,3)))","v":0},{"$f":"IF(V14=\"\",0,IF(OR($B14=\"ピアザH(準)\",$B14=\"大会議室(準)\"),7,IF(OR(PG!$J$2<13,PG!$J$2=13),3,$B16)))","v":0},{"$f":"IF(W14=\"\",0,IF(OR($B14=\"ピアザH(準)\",$B14=\"大会議室(準)\"),7,IF(PG!$J$2<18,3,$B16)))","v":0},{"$f":"IF(AND($P$2=1,U14<>\"\"),利用申込書1!$Z$52,\"\")","v":""},{"$f":"IF(AND($P$2=1,U14<>\"\"),利用申込書1!$AD$52,\"\")","v":""},{"$f":"IF(AND($P$2=1,U14=\"\",V14<>\"\"),利用申込書1!$Z$52,\"\")","v":""},{"$f":"IF(AND($P$2=1, U14=\"\",V14<>\"\"),利用申込書1!$AD$52,\"\")","v":""},{"$f":"IF(AND($P$2=1,U14=\"\",V14=\"\",W14<>\"\"),利用申込書1!$Z$52,\"\")","v":""},{"$f":"IF(AND($P$2=1, U14=\"\",V14=\"\",W14<>\"\"),利用申込書1!$AD$52,\"\")","v":""},"0号室"]
[null,null,{"$f":"IF(R15=R11,\"\",$C$3)","v":""},{"$f":"PG!$Q$23","v":"18:00-21:00"},1,{"$f":"IF(OR(S15=101,S15=102,S15=208,S15=209),\"別紙参照\",\"\")","v":""},{"$f":"IF(利用申込書1!$A$35=\"\",$R$11,利用申込書1!$A$35)","v":"1月0日"},{"$f":"H14","v":0},null,null,null,null,null,null,null,null,{"$f":"Q14+0.3","v":0.3},{"$f":"R14","v":"1月0日"},{"$f":"S14","v":0},null,null,null,null,null,null,null,{"$f":"IF(AND($P$2=2,U14<>\"\"),利用申込書1!$Z$52,\"\")","v":""},{"$f":"IF(AND($P$2=2,U14<>\"\"),利用申込書1!$AD$52,\"\")","v":""},{"$f":"IF(AND($P$2=2,U14=\"\",V14<>\"\"),利用申込書1!$Z$52,\"\")","v":""},{"$f":"IF(AND($P$2=2,U14=\"\",V14<>\"\"),利用申込書1!$AD$52,\"\")","v":""},{"$f":"IF(AND($P$2=2,U14=\"\",V14=\"\",W14<>\"\"),利用申込書1!$Z$52,\"\")","v":""},{"$f":"IF(AND($P$2=2, U14=\"\",V14=\"\",W14<>\"\"),利用申込書1!$AD$52,\"\")","v":""},"0号室"]
[null,{"$f":"IF(T14=0,\"\",IF(VLOOKUP(T14,DATA!$B$28:$P$49,15,FALSE)>利用申込書1!$Y$23,利用申込書1!$Y$23,VLOOKUP(T14,DATA!$B$28:$P$49,15,FALSE)))","v":""},{"$f":"PG!$H$1","v":"：～："},{"$f":"CHOOSE(PG!H23,VLOOKUP(S14,DATA!$A$129:$N$151,3,FALSE),VLOOKUP(S14,DATA!$A$129:$N$151,4,FALSE),VLOOKUP(S14,DATA!$A$129:$N$151,5,FALSE),VLOOKUP(S14,DATA!$A$129:$N$151,6,FALSE),VLOOKUP(S14,DATA!$A$129:$N$151,7,FALSE),VLOOKUP(S14,DATA!$A$129:$N$151,8,FALSE),VLOOKUP(S14,DATA!$A$129:$N$151,9,FALSE),VLOOKUP(S14,DATA!$A$129:$N$151,10,FALSE),VLOOKUP(S14,DATA!$A$129:$N$151,11,FALSE),VLOOKUP(S14,DATA!$A$129:$N$151,12,FALSE),VLOOKUP(S14,DATA!$A$129:$N$151,13,FALSE),VLOOKUP(S14,DATA!$A$129:$N$151,14,FALSE),\"\")","v":{"$error":"#N/A"}},1,null,{"$f":"IF(利用申込書1!$A$35=\"\",$R$11,利用申込書1!$A$35)","v":"1月0日"},{"$f":"H14","v":0},null,null,null,null,null,null,null,null,null,{"$f":"R14","v":"1月0日"},{"$f":"S14","v":0},{"$f":"利用申込書1!$Y$23","v":0},null,null,null,null,null,null,null,null,null,null,null,null,"0号室"]
[{"$f":"IF(OR(S17<=207,S17=101,S17=102),\"2階\",IF(OR(S17=208,S17=209, S17 =210),\"1階\",\"3階\"))","v":"2階"},{"$f":"IF(T17=0,\"\",VLOOKUP(T17,DATA!$B$28:$O$49,14,FALSE))","v":""},{"$f":"IF(OR(B17=\"ピアザH(準)\",B17=\"大会議室(準)\"),\"準備(掲示なし)\",IF(AND(R14=R17, B14<>\"ピアザH(準)\"),\"同上\",利用申込書1!$F$21))","v":"同上"},{"$f":"PG!$O$27","v":"夜間"},{"$f":"PG!F27","v":2},null,{"$f":"IF(利用申込書1!$A$37=\"\",$R$14,利用申込書1!$A$37)","v":"1月0日"},{"$f":"VLOOKUP(T17,DATA!$B$2:$O$25,14,FALSE)","v":0},null,{"$f":"利用申込書1!AG37","v":""},{"$f":"VLOOKUP($S17,$B$130:$D$151,3,FALSE)","v":{"$error":"#N/A"}},0,null,null,null,null,{"$f":"IF(S17=102,101,IF(S17=209,208,S17))","v":0},{"$f":"PG!V28","v":"1月0日"},{"$f":"VLOOKUP(T17,DATA!$B$2:$O$25,14,FALSE)","v":0},{"$f":"PG!D27","v":0},{"$f":"IF(利用申込書1!M37=\"\",利用申込書1!R37,利用申込書1!R37+利用申込書1!M37)","v":""},{"$f":"利用申込書1!W37","v":""},{"$f":"利用申込書1!AB37","v":""},{"$f":"IF(U17=\"\",0,IF(OR($B17=\"ピアザH(準)\",$B17=\"大会議室(準)\"),7,IF(OR(PG!$I$2<12,PG!$I$2=12),B19,3)))","v":0},{"$f":"IF(V17=\"\",0,IF(OR($B17=\"ピアザH(準)\",$B17=\"大会議室(準)\"),7,IF(OR(PG!$J$2<13,PG!$J$2=13),3,$B19)))","v":0},{"$f":"IF(W17=\"\",0,IF(OR($B17=\"ピアザH(準)\",$B17=\"大会議室(準)\"),7,IF(PG!$J$2<18,3,$B19)))","v":0},{"$f":"IF(AND($P$2=1,U17<>\"\"),利用申込書1!$Z$52,\"\")","v":""},{"$f":"IF(AND($P$2=1,U17<>\"\"),利用申込書1!$AD$52,\"\")","v":""},{"$f":"IF(AND($P$2=1,U17=\"\",V17<>\"\"),利用申込書1!$Z$52,\"\")","v":""},{"$f":"IF(AND($P$2=1, U17=\"\",V17<>\"\"),利用申込書1!$AD$52,\"\")","v":""},{"$f":"IF(AND($P$2=1,U17=\"\",V17=\"\",W17<>\"\"),利用申込書1!$Z$52,\"\")","v":""},{"$f":"IF(AND($P$2=1, U17=\"\",V17=\"\",W17<>\"\"),利用申込書1!$AD$52,\"\")","v":""},"0号室"]
[null,null,{"$f":"IF(R18=R14,\"\",$C$3)","v":""},{"$f":"PG!$Q$27","v":"18:00-21:00"},1,{"$f":"IF(OR(S18=101,S18=102,S18=208,S18=209),\"別紙参照\",\"\")","v":""},{"$f":"IF(利用申込書1!$A$37=\"\",$R$14,利用申込書1!$A$37)","v":"1月0日"},{"$f":"H17","v":0},null,null,null,null,null,null,null,null,{"$f":"Q17+0.3","v":0.3},{"$f":"R17","v":"1月0日"},{"$f":"S17","v":0},null,null,null,null,null,null,null,{"$f":"IF(AND($P$2=2,U17<>\"\"),利用申込書1!$Z$52,\"\")","v":""},{"$f":"IF(AND($P$2=2,U17<>\"\"),利用申込書1!$AD$52,\"\")","v":""},{"$f":"IF(AND($P$2=2,U17=\"\",V17<>\"\"),利用申込書1!$Z$52,\"\")","v":""},{"$f":"IF(AND($P$2=2,U17=\"\",V17<>\"\"),利用申込書1!$AD$52,\"\")","v":""},{"$f":"IF(AND($P$2=2,U17=\"\",V17=\"\",W17<>\"\"),利用申込書1!$Z$52,\"\")","v":""},{"$f":"IF(AND($P$2=2, U17=\"\",V17=\"\",W17<>\"\"),利用申込書1!$AD$52,\"\")","v":""},"0号室"]
[null,{"$f":"IF(T17=0,\"\",IF(VLOOKUP(T17,DATA!$B$28:$P$49,15,FALSE)>利用申込書1!$Y$23,利用申込書1!$Y$23,VLOOKUP(T17,DATA!$B$28:$P$49,15,FALSE)))","v":""},{"$f":"PG!$H$1","v":"：～："},{"$f":"CHOOSE(PG!H27,VLOOKUP(S17,DATA!$A$129:$N$151,3,FALSE),VLOOKUP(S17,DATA!$A$129:$N$151,4,FALSE),VLOOKUP(S17,DATA!$A$129:$N$151,5,FALSE),VLOOKUP(S17,DATA!$A$129:$N$151,6,FALSE),VLOOKUP(S17,DATA!$A$129:$N$151,7,FALSE),VLOOKUP(S17,DATA!$A$129:$N$151,8,FALSE),VLOOKUP(S17,DATA!$A$129:$N$151,9,FALSE),VLOOKUP(S17,DATA!$A$129:$N$151,10,FALSE),VLOOKUP(S17,DATA!$A$129:$N$151,11,FALSE),VLOOKUP(S17,DATA!$A$129:$N$151,12,FALSE),VLOOKUP(S17,DATA!$A$129:$N$151,13,FALSE),VLOOKUP(S17,DATA!$A$129:$N$151,14,FALSE),\"\")","v":{"$error":"#N/A"}},1,null,{"$f":"IF(利用申込書1!$A$37=\"\",$R$14,利用申込書1!$A$37)","v":"1月0日"},{"$f":"H17","v":0},null,null,null,null,null,null,null,null,null,{"$f":"R17","v":"1月0日"},{"$f":"S17","v":0},{"$f":"利用申込書1!$Y$23","v":0},null,null,null,null,null,null,null,null,null,null,null,null,"0号室"]
[{"$f":"IF(OR(S20<=207,S20=101,S20=102),\"2階\",IF(OR(S20=208,S20=209, S20 =210),\"1階\",\"3階\"))","v":"2階"},{"$f":"IF(T20=0,\"\",VLOOKUP(T20,DATA!$B$28:$O$49,14,FALSE))","v":""},{"$f":"IF(OR(B20=\"ピアザH(準)\",B20=\"大会議室(準)\"),\"準備(掲示なし)\",IF(AND(R17=R20, B17<>\"ピアザH(準)\"),\"同上\",利用申込書1!$F$21))","v":"同上"},{"$f":"PG!$O$31","v":"夜間"},{"$f":"PG!F31","v":2},null,{"$f":"IF(利用申込書1!$A$39=\"\",$R$17,利用申込書1!$A$39)","v":"1月0日"},{"$f":"VLOOKUP(T20,DATA!$B$2:$O$25,14,FALSE)","v":0},null,{"$f":"利用申込書1!AG39","v":""},{"$f":"VLOOKUP($S20,$B$130:$D$151,3,FALSE)","v":{"$error":"#N/A"}},0,null,null,null,null,{"$f":"IF(S20=102,101,IF(S20=209,208,S20))","v":0},{"$f":"PG!V32","v":"1月0日"},{"$f":"VLOOKUP(T20,DATA!$B$2:$O$25,14,FALSE)","v":0},{"$f":"PG!D31","v":0},{"$f":"IF(利用申込書1!M39=\"\",利用申込書1!R39,利用申込書1!R39+利用申込書1!M39)","v":""},{"$f":"利用申込書1!W39","v":""},{"$f":"利用申込書1!AB39","v":""},{"$f":"IF(U20=\"\",0,IF(OR($B20=\"ピアザH(準)\",$B20=\"大会議室(準)\"),7,IF(OR(PG!$I$2<12,PG!$I$2=12),B22,3)))","v":0},{"$f":"IF(V20=\"\",0,IF(OR($B20=\"ピアザH(準)\",$B20=\"大会議室(準)\"),7,IF(OR(PG!$J$2<13,PG!$J$2=13),3,$B22)))","v":0},{"$f":"IF(W20=\"\",0,IF(OR($B20=\"ピアザH(準)\",$B20=\"大会議室(準)\"),7,IF(PG!$J$2<18,3,$B22)))","v":0},{"$f":"IF(AND($P$2=1,U20<>\"\"),利用申込書1!$Z$52,\"\")","v":""},{"$f":"IF(AND($P$2=1,U20<>\"\"),利用申込書1!$AD$52,\"\")","v":""},{"$f":"IF(AND($P$2=1,U20=\"\",V20<>\"\"),利用申込書1!$Z$52,\"\")","v":""},{"$f":"IF(AND($P$2=1, U20=\"\",V20<>\"\"),利用申込書1!$AD$52,\"\")","v":""},{"$f":"IF(AND($P$2=1,U20=\"\",V20=\"\",W20<>\"\"),利用申込書1!$Z$52,\"\")","v":""},{"$f":"IF(AND($P$2=1, U20=\"\",V20=\"\",W20<>\"\"),利用申込書1!$AD$52,\"\")","v":""},"0号室"]
[null,null,{"$f":"IF(R21=R17,\"\",$C$3)","v":""},{"$f":"PG!$Q$31","v":"18:00-21:00"},1,{"$f":"IF(OR(S21=101,S21=102,S21=208,S21=209),\"別紙参照\",\"\")","v":""},{"$f":"IF(利用申込書1!$A$39=\"\",$R$17,利用申込書1!$A$39)","v":"1月0日"},{"$f":"H20","v":0},null,null,null,null,null,null,null,null,{"$f":"Q20+0.3","v":0.3},{"$f":"R20","v":"1月0日"},{"$f":"S20","v":0},null,null,null,null,null,null,null,{"$f":"IF(AND($P$2=2,U20<>\"\"),利用申込書1!$Z$52,\"\")","v":""},{"$f":"IF(AND($P$2=2,U20<>\"\"),利用申込書1!$AD$52,\"\")","v":""},{"$f":"IF(AND($P$2=2,U20=\"\",V20<>\"\"),利用申込書1!$Z$52,\"\")","v":""},{"$f":"IF(AND($P$2=2,U20=\"\",V20<>\"\"),利用申込書1!$AD$52,\"\")","v":""},{"$f":"IF(AND($P$2=2,U20=\"\",V20=\"\",W20<>\"\"),利用申込書1!$Z$52,\"\")","v":""},{"$f":"IF(AND($P$2=2, U20=\"\",V20=\"\",W20<>\"\"),利用申込書1!$AD$52,\"\")","v":""},"0号室"]
[null,{"$f":"IF(T20=0,\"\",IF(VLOOKUP(T20,DATA!$B$28:$P$49,15,FALSE)>利用申込書1!$Y$23,利用申込書1!$Y$23,VLOOKUP(T20,DATA!$B$28:$P$49,15,FALSE)))","v":""},{"$f":"PG!$H$1","v":"：～："},{"$f":"CHOOSE(PG!H31,VLOOKUP(S20,DATA!$A$129:$N$151,3,FALSE),VLOOKUP(S20,DATA!$A$129:$N$151,4,FALSE),VLOOKUP(S20,DATA!$A$129:$N$151,5,FALSE),VLOOKUP(S20,DATA!$A$129:$N$151,6,FALSE),VLOOKUP(S20,DATA!$A$129:$N$151,7,FALSE),VLOOKUP(S20,DATA!$A$129:$N$151,8,FALSE),VLOOKUP(S20,DATA!$A$129:$N$151,9,FALSE),VLOOKUP(S20,DATA!$A$129:$N$151,10,FALSE),VLOOKUP(S20,DATA!$A$129:$N$151,11,FALSE),VLOOKUP(S20,DATA!$A$129:$N$151,12,FALSE),VLOOKUP(S20,DATA!$A$129:$N$151,13,FALSE),VLOOKUP(S20,DATA!$A$129:$N$151,14,FALSE),\"\")","v":{"$error":"#N/A"}},1,null,{"$f":"IF(利用申込書1!$A$39=\"\",$R$17,利用申込書1!$A$39)","v":"1月0日"},{"$f":"H20","v":0},null,null,null,null,null,null,null,null,null,{"$f":"R20","v":"1月0日"},{"$f":"S20","v":0},{"$f":"利用申込書1!$Y$23","v":0},null,null,null,null,null,null,null,null,null,null,null,null,"0号室"]
[{"$f":"IF(OR(S23<=207,S23=101,S23=102),\"2階\",IF(OR(S23=208,S23=209, S23 =210),\"1階\",\"3階\"))","v":"2階"},{"$f":"IF(T23=0,\"\",VLOOKUP(T23,DATA!$B$28:$O$49,14,FALSE))","v":""},{"$f":"IF(OR(B23=\"ピアザH(準)\",B23=\"大会議室(準)\"),\"準備(掲示なし)\",IF(AND(R20=R23, B20<>\"ピアザH(準)\"),\"同上\",利用申込書1!$F$21))","v":"同上"},{"$f":"PG!$O$35","v":"夜間"},{"$f":"PG!F35","v":2},null,{"$f":"IF(利用申込書1!$A$41=\"\",$R$20,利用申込書1!$A$41)","v":"1月0日"},{"$f":"VLOOKUP(T23,DATA!$B$2:$O$25,14,FALSE)","v":0},null,{"$f":"利用申込書1!AG41","v":""},{"$f":"VLOOKUP($S23,$B$130:$D$151,3,FALSE)","v":{"$error":"#N/A"}},0,null,null,null,null,{"$f":"IF(S23=102,101,IF(S23=209,208,S23))","v":0},{"$f":"PG!V36","v":"1月0日"},{"$f":"VLOOKUP(T23,DATA!$B$2:$O$25,14,FALSE)","v":0},{"$f":"PG!D35","v":0},{"$f":"IF(利用申込書1!M41=\"\",利用申込書1!R41,利用申込書1!R41+利用申込書1!M41)","v":""},{"$f":"利用申込書1!W41","v":""},{"$f":"利用申込書1!AB41","v":""},{"$f":"IF(U23=\"\",0,IF(OR($B23=\"ピアザH(準)\",$B23=\"大会議室(準)\"),7,IF(OR(PG!$I$2<12,PG!$I$2=12),B25,3)))","v":0},{"$f":"IF(V23=\"\",0,IF(OR($B23=\"ピアザH(準)\",$B23=\"大会議室(準)\"),7,IF(OR(PG!$J$2<13,PG!$J$2=13),3,$B25)))","v":0},{"$f":"IF(W23=\"\",0,IF(OR($B23=\"ピアザH(準)\",$B23=\"大会議室(準)\"),7,IF(PG!$J$2<18,3,$B25)))","v":0},{"$f":"IF(AND($P$2=1,U23<>\"\"),利用申込書1!$Z$52,\"\")","v":""},{"$f":"IF(AND($P$2=1,U23<>\"\"),利用申込書1!$AD$52,\"\")","v":""},{"$f":"IF(AND($P$2=1,U23=\"\",V23<>\"\"),利用申込書1!$Z$52,\"\")","v":""},{"$f":"IF(AND($P$2=1, U23=\"\",V23<>\"\"),利用申込書1!$AD$52,\"\")","v":""},{"$f":"IF(AND($P$2=1,U23=\"\",V23=\"\",W23<>\"\"),利用申込書1!$Z$52,\"\")","v":""},{"$f":"IF(AND($P$2=1, U23=\"\",V23=\"\",W23<>\"\"),利用申込書1!$AD$52,\"\")","v":""},"0号室"]
[null,null,{"$f":"IF(R24=R20,\"\",$C$3)","v":""},{"$f":"PG!$Q$35","v":"18:00-21:00"},1,{"$f":"IF(OR(S24=101,S24=102,S24=208,S24=209),\"別紙参照\",\"\")","v":""},{"$f":"IF(利用申込書1!$A$41=\"\",$R$20,利用申込書1!$A$41)","v":"1月0日"},{"$f":"H23","v":0},null,null,null,null,null,null,null,null,{"$f":"Q23+0.3","v":0.3},{"$f":"R23","v":"1月0日"},{"$f":"S23","v":0},null,null,null,null,null,null,null,{"$f":"IF(AND($P$2=2,U23<>\"\"),利用申込書1!$Z$52,\"\")","v":""},{"$f":"IF(AND($P$2=2,U23<>\"\"),利用申込書1!$AD$52,\"\")","v":""},{"$f":"IF(AND($P$2=2,U23=\"\",V23<>\"\"),利用申込書1!$Z$52,\"\")","v":""},{"$f":"IF(AND($P$2=2,U23=\"\",V23<>\"\"),利用申込書1!$AD$52,\"\")","v":""},{"$f":"IF(AND($P$2=2,U23=\"\",V23=\"\",W23<>\"\"),利用申込書1!$Z$52,\"\")","v":""},{"$f":"IF(AND($P$2=2, U23=\"\",V23=\"\",W23<>\"\"),利用申込書1!$AD$52,\"\")","v":""},"0号室"]
[null,{"$f":"IF(T23=0,\"\",IF(VLOOKUP(T23,DATA!$B$28:$P$49,15,FALSE)>利用申込書1!$Y$23,利用申込書1!$Y$23,VLOOKUP(T23,DATA!$B$28:$P$49,15,FALSE)))","v":""},{"$f":"PG!$H$1","v":"：～："},{"$f":"CHOOSE(PG!H35,VLOOKUP(S23,DATA!$A$129:$N$151,3,FALSE),VLOOKUP(S23,DATA!$A$129:$N$151,4,FALSE),VLOOKUP(S23,DATA!$A$129:$N$151,5,FALSE),VLOOKUP(S23,DATA!$A$129:$N$151,6,FALSE),VLOOKUP(S23,DATA!$A$129:$N$151,7,FALSE),VLOOKUP(S23,DATA!$A$129:$N$151,8,FALSE),VLOOKUP(S23,DATA!$A$129:$N$151,9,FALSE),VLOOKUP(S23,DATA!$A$129:$N$151,10,FALSE),VLOOKUP(S23,DATA!$A$129:$N$151,11,FALSE),VLOOKUP(S23,DATA!$A$129:$N$151,12,FALSE),VLOOKUP(S23,DATA!$A$129:$N$151,13,FALSE),VLOOKUP(S23,DATA!$A$129:$N$151,14,FALSE),\"\")","v":{"$error":"#N/A"}},1,null,{"$f":"IF(利用申込書1!$A$41=\"\",$R$20,利用申込書1!$A$41)","v":"1月0日"},{"$f":"H23","v":0},null,null,null,null,null,null,null,null,null,{"$f":"R23","v":"1月0日"},{"$f":"S23","v":0},{"$f":"利用申込書1!$Y$23","v":0},null,null,null,null,null,null,null,null,null,null,null,null,"0号室"]
[null,{"$f":"IF(T26=0,\"\",VLOOKUP(T26,DATA!$B$28:$O$49,14,FALSE))","v":""},{"$f":"IF(OR(B26=\"ピアザH(準)\",B26=\"大会議室(準)\"),\"準備(掲示なし)\",IF(AND(R23=R26, B23<>\"ピアザH(準)\"),\"同上\",利用申込書1!$F$21))","v":"同上"},{"$f":"PG!$O$39","v":"夜間"},null,null,{"$f":"IF(利用申込書2!$A$10=\"\",$R$23,利用申込書2!$A$10)","v":"1月0日"},{"$f":"VLOOKUP(T26,DATA!$B$2:$O$25,14,FALSE)","v":0},null,{"$f":"利用申込書2!AG10","v":""},{"$f":"VLOOKUP($S26,$B$130:$D$151,3,FALSE)","v":{"$error":"#N/A"}},null,null,null,null,null,{"$f":"IF(S26=102,101,IF(S26=209,208,S26))","v":0},{"$f":"PG!V40","v":"1月0日"},{"$f":"VLOOKUP(T26,DATA!$B$2:$O$25,14,FALSE)","v":0},{"$f":"PG!D39","v":0},{"$f":"IF(利用申込書2!M10=\"\",利用申込書2!R10,利用申込書2!R10+利用申込書2!M10)","v":""},{"$f":"利用申込書2!W10","v":""},{"$f":"利用申込書2!AB10","v":""},{"$f":"IF(U26=\"\",0,IF(OR($B26=\"ピアザH(準)\",$B26=\"大会議室(準)\"),7,IF(OR(PG!$I$2<12,PG!$I$2=12),B28,3)))","v":0},{"$f":"IF(V26=\"\",0,IF(OR($B26=\"ピアザH(準)\",$B26=\"大会議室(準)\"),7,IF(OR(PG!$J$2<13,PG!$J$2=13),3,$B28)))","v":0},{"$f":"IF(W26=\"\",0,IF(OR($B26=\"ピアザH(準)\",$B26=\"大会議室(準)\"),7,IF(PG!$J$2<18,3,$B28)))","v":0},{"$f":"IF(AND($P$2=1,U26<>\"\"),利用申込書1!$Z$52,\"\")","v":""},{"$f":"IF(AND($P$2=1,U26<>\"\"),利用申込書1!$AD$52,\"\")","v":""},{"$f":"IF(AND($P$2=1,U26=\"\",V26<>\"\"),利用申込書1!$Z$52,\"\")","v":""},{"$f":"IF(AND($P$2=1, U26=\"\",V26<>\"\"),利用申込書1!$AD$52,\"\")","v":""},{"$f":"IF(AND($P$2=1,U26=\"\",V26=\"\",W26<>\"\"),利用申込書1!$Z$52,\"\")","v":""},{"$f":"IF(AND($P$2=1, U26=\"\",V26=\"\",W26<>\"\"),利用申込書1!$AD$52,\"\")","v":""},"0号室"]
[null,null,{"$f":"IF(R27=R23,\"\",$C$3)","v":""},{"$f":"PG!$Q$39","v":"18:00-21:00"},null,null,{"$f":"IF(利用申込書2!$A$10=\"\",$R$23,利用申込書2!$A$10)","v":"1月0日"},{"$f":"H26","v":0},null,null,null,null,null,null,null,null,{"$f":"Q26+0.3","v":0.3},{"$f":"R26","v":"1月0日"},{"$f":"S26","v":0},null,null,null,null,null,null,null,{"$f":"IF(AND($P$2=2,U26<>\"\"),利用申込書1!$Z$52,\"\")","v":""},{"$f":"IF(AND($P$2=2,U26<>\"\"),利用申込書1!$AD$52,\"\")","v":""},{"$f":"IF(AND($P$2=2,U26=\"\",V26<>\"\"),利用申込書1!$Z$52,\"\")","v":""},{"$f":"IF(AND($P$2=2,U26=\"\",V26<>\"\"),利用申込書1!$AD$52,\"\")","v":""},{"$f":"IF(AND($P$2=2,U26=\"\",V26=\"\",W26<>\"\"),利用申込書1!$Z$52,\"\")","v":""},{"$f":"IF(AND($P$2=2, U26=\"\",V26=\"\",W26<>\"\"),利用申込書1!$AD$52,\"\")","v":""},"0号室"]
[null,{"$f":"IF(T26=0,\"\",IF(VLOOKUP(T26,DATA!$B$28:$P$49,15,FALSE)>利用申込書1!$Y$23,利用申込書1!$Y$23,VLOOKUP(T26,DATA!$B$28:$P$49,15,FALSE)))","v":""},{"$f":"PG!$H$1","v":"：～："},{"$f":"CHOOSE(PG!H39,VLOOKUP(S26,DATA!$A$129:$N$151,3,FALSE),VLOOKUP(S26,DATA!$A$129:$N$151,4,FALSE),VLOOKUP(S26,DATA!$A$129:$N$151,5,FALSE),VLOOKUP(S26,DATA!$A$129:$N$151,6,FALSE),VLOOKUP(S26,DATA!$A$129:$N$151,7,FALSE),VLOOKUP(S26,DATA!$A$129:$N$151,8,FALSE),VLOOKUP(S26,DATA!$A$129:$N$151,9,FALSE),VLOOKUP(S26,DATA!$A$129:$N$151,10,FALSE),VLOOKUP(S26,DATA!$A$129:$N$151,11,FALSE),VLOOKUP(S26,DATA!$A$129:$N$151,12,FALSE),VLOOKUP(S26,DATA!$A$129:$N$151,13,FALSE),VLOOKUP(S26,DATA!$A$129:$N$151,14,FALSE),\"\")","v":{"$error":"#N/A"}},null,null,{"$f":"IF(利用申込書2!$A$10=\"\",$R$23,利用申込書2!$A$10)","v":"1月0日"},{"$f":"H26","v":0},null,null,null,null,null,null,null,null,null,{"$f":"R26","v":"1月0日"},{"$f":"S26","v":0},null,null,null,null,null,null,null,null,null,null,null,null,null,"0号室"]
[null,{"$f":"IF(T29=0,\"\",VLOOKUP(T29,DATA!$B$28:$O$49,14,FALSE))","v":""},{"$f":"IF(OR(B29=\"ピアザH(準)\",B29=\"大会議室(準)\"),\"準備(掲示なし)\",IF(AND(R26=R29, B26<>\"ピアザH(準)\"),\"同上\",利用申込書1!$F$21))","v":"同上"},{"$f":"PG!$O$43","v":"夜間"},null,null,{"$f":"IF(利用申込書2!$A$12=\"\",$R$26,利用申込書2!$A$12)","v":"1月0日"},{"$f":"VLOOKUP(T29,DATA!$B$2:$O$25,14,FALSE)","v":0},null,{"$f":"利用申込書2!AG12","v":""},{"$f":"VLOOKUP($S29,$B$130:$D$151,3,FALSE)","v":{"$error":"#N/A"}},null,null,null,null,null,{"$f":"IF(S29=102,101,IF(S29=209,208,S29))","v":0},{"$f":"PG!V44","v":"1月0日"},{"$f":"VLOOKUP(T29,DATA!$B$2:$O$25,14,FALSE)","v":0},{"$f":"PG!D43","v":0},{"$f":"IF(利用申込書2!M12=\"\",利用申込書2!R12,利用申込書2!R12+利用申込書2!M12)","v":""},{"$f":"利用申込書2!W12","v":""},{"$f":"利用申込書2!AB12","v":""},{"$f":"IF(U29=\"\",0,IF(OR($B29=\"ピアザH(準)\",$B29=\"大会議室(準)\"),7,IF(OR(PG!$I$2<12,PG!$I$2=12),B31,3)))","v":0},{"$f":"IF(V29=\"\",0,IF(OR($B29=\"ピアザH(準)\",$B29=\"大会議室(準)\"),7,IF(OR(PG!$J$2<13,PG!$J$2=13),3,$B31)))","v":0},{"$f":"IF(W29=\"\",0,IF(OR($B29=\"ピアザH(準)\",$B29=\"大会議室(準)\"),7,IF(PG!$J$2<18,3,$B31)))","v":0},{"$f":"IF(AND($P$2=1,U29<>\"\"),利用申込書1!$Z$52,\"\")","v":""},{"$f":"IF(AND($P$2=1,U29<>\"\"),利用申込書1!$AD$52,\"\")","v":""},{"$f":"IF(AND($P$2=1,U29=\"\",V29<>\"\"),利用申込書1!$Z$52,\"\")","v":""},{"$f":"IF(AND($P$2=1, U29=\"\",V29<>\"\"),利用申込書1!$AD$52,\"\")","v":""},{"$f":"IF(AND($P$2=1,U29=\"\",V29=\"\",W29<>\"\"),利用申込書1!$Z$52,\"\")","v":""},{"$f":"IF(AND($P$2=1, U29=\"\",V29=\"\",W29<>\"\"),利用申込書1!$AD$52,\"\")","v":""},"0号室"]
[null,null,{"$f":"IF(R30=R26,\"\",$C$3)","v":""},{"$f":"PG!$Q$43","v":"18:00-21:00"},null,null,{"$f":"IF(利用申込書2!$A$12=\"\",$R$26,利用申込書2!$A$12)","v":"1月0日"},{"$f":"H29","v":0},null,null,null,null,null,null,null,null,{"$f":"Q29+0.3","v":0.3},{"$f":"R29","v":"1月0日"},{"$f":"S29","v":0},null,null,null,null,null,null,null,{"$f":"IF(AND($P$2=2,U29<>\"\"),利用申込書1!$Z$52,\"\")","v":""},{"$f":"IF(AND($P$2=2,U29<>\"\"),利用申込書1!$AD$52,\"\")","v":""},{"$f":"IF(AND($P$2=2,U29=\"\",V29<>\"\"),利用申込書1!$Z$52,\"\")","v":""},{"$f":"IF(AND($P$2=2,U29=\"\",V29<>\"\"),利用申込書1!$AD$52,\"\")","v":""},{"$f":"IF(AND($P$2=2,U29=\"\",V29=\"\",W29<>\"\"),利用申込書1!$Z$52,\"\")","v":""},{"$f":"IF(AND($P$2=2, U29=\"\",V29=\"\",W29<>\"\"),利用申込書1!$AD$52,\"\")","v":""},"0号室"]
[null,{"$f":"IF(T29=0,\"\",IF(VLOOKUP(T29,DATA!$B$28:$P$49,15,FALSE)>利用申込書1!$Y$23,利用申込書1!$Y$23,VLOOKUP(T29,DATA!$B$28:$P$49,15,FALSE)))","v":""},{"$f":"PG!$H$1","v":"：～："},{"$f":"CHOOSE(PG!H43,VLOOKUP(S29,DATA!$A$129:$N$151,3,FALSE),VLOOKUP(S29,DATA!$A$129:$N$151,4,FALSE),VLOOKUP(S29,DATA!$A$129:$N$151,5,FALSE),VLOOKUP(S29,DATA!$A$129:$N$151,6,FALSE),VLOOKUP(S29,DATA!$A$129:$N$151,7,FALSE),VLOOKUP(S29,DATA!$A$129:$N$151,8,FALSE),VLOOKUP(S29,DATA!$A$129:$N$151,9,FALSE),VLOOKUP(S29,DATA!$A$129:$N$151,10,FALSE),VLOOKUP(S29,DATA!$A$129:$N$151,11,FALSE),VLOOKUP(S29,DATA!$A$129:$N$151,12,FALSE),VLOOKUP(S29,DATA!$A$129:$N$151,13,FALSE),VLOOKUP(S29,DATA!$A$129:$N$151,14,FALSE),\"\")","v":{"$error":"#N/A"}},null,null,{"$f":"IF(利用申込書2!$A$12=\"\",$R$26,利用申込書2!$A$12)","v":"1月0日"},{"$f":"H29","v":0},null,null,null,null,null,null,null,null,null,{"$f":"R29","v":"1月0日"},{"$f":"S29","v":0},null,null,null,null,null,null,null,null,null,null,null,null,null,"0号室"]
[null,{"$f":"IF(T32=0,\"\",VLOOKUP(T32,DATA!$B$28:$O$49,14,FALSE))","v":""},{"$f":"IF(OR(B32=\"ピアザH(準)\",B32=\"大会議室(準)\"),\"準備(掲示なし)\",IF(AND(R29=R32, B29<>\"ピアザH(準)\"),\"同上\",利用申込書1!$F$21))","v":"同上"},{"$f":"PG!$O$47","v":"夜間"},null,null,{"$f":"IF(利用申込書2!$A$14=\"\",$R$29,利用申込書2!$A$14)","v":"1月0日"},{"$f":"VLOOKUP(T32,DATA!$B$2:$O$25,14,FALSE)","v":0},null,{"$f":"利用申込書2!AG14","v":""},{"$f":"VLOOKUP($S32,$B$130:$D$151,3,FALSE)","v":{"$error":"#N/A"}},null,null,null,null,null,{"$f":"IF(S32=102,101,IF(S32=209,208,S32))","v":0},{"$f":"PG!V48","v":"1月0日"},{"$f":"VLOOKUP(T32,DATA!$B$2:$O$25,14,FALSE)","v":0},{"$f":"PG!D47","v":0},{"$f":"IF(利用申込書2!M14=\"\",利用申込書2!R14,利用申込書2!R14+利用申込書2!M14)","v":""},{"$f":"利用申込書2!W14","v":""},{"$f":"利用申込書2!AB14","v":""},{"$f":"IF(U32=\"\",0,IF(OR($B32=\"ピアザH(準)\",$B32=\"大会議室(準)\"),7,IF(OR(PG!$I$2<12,PG!$I$2=12),B34,3)))","v":0},{"$f":"IF(V32=\"\",0,IF(OR($B32=\"ピアザH(準)\",$B32=\"大会議室(準)\"),7,IF(OR(PG!$J$2<13,PG!$J$2=13),3,$B34)))","v":0},{"$f":"IF(W32=\"\",0,IF(OR($B32=\"ピアザH(準)\",$B32=\"大会議室(準)\"),7,IF(PG!$J$2<18,3,$B34)))","v":0},{"$f":"IF(AND($P$2=1,U32<>\"\"),利用申込書1!$Z$52,\"\")","v":""},{"$f":"IF(AND($P$2=1,U32<>\"\"),利用申込書1!$AD$52,\"\")","v":""},{"$f":"IF(AND($P$2=1,U32=\"\",V32<>\"\"),利用申込書1!$Z$52,\"\")","v":""},{"$f":"IF(AND($P$2=1, U32=\"\",V32<>\"\"),利用申込書1!$AD$52,\"\")","v":""},{"$f":"IF(AND($P$2=1,U32=\"\",V32=\"\",W32<>\"\"),利用申込書1!$Z$52,\"\")","v":""},{"$f":"IF(AND($P$2=1, U32=\"\",V32=\"\",W32<>\"\"),利用申込書1!$AD$52,\"\")","v":""},"0号室"]
[null,null,{"$f":"IF(R33=R29,\"\",$C$3)","v":""},{"$f":"PG!$Q$47","v":"18:00-21:00"},null,null,{"$f":"IF(利用申込書2!$A$14=\"\",$R$29,利用申込書2!$A$14)","v":"1月0日"},{"$f":"H32","v":0},null,null,null,null,null,null,null,null,{"$f":"Q32+0.3","v":0.3},{"$f":"R32","v":"1月0日"},{"$f":"S32","v":0},null,null,null,null,null,null,null,{"$f":"IF(AND($P$2=2,U32<>\"\"),利用申込書1!$Z$52,\"\")","v":""},{"$f":"IF(AND($P$2=2,U32<>\"\"),利用申込書1!$AD$52,\"\")","v":""},{"$f":"IF(AND($P$2=2,U32=\"\",V32<>\"\"),利用申込書1!$Z$52,\"\")","v":""},{"$f":"IF(AND($P$2=2,U32=\"\",V32<>\"\"),利用申込書1!$AD$52,\"\")","v":""},{"$f":"IF(AND($P$2=2,U32=\"\",V32=\"\",W32<>\"\"),利用申込書1!$Z$52,\"\")","v":""},{"$f":"IF(AND($P$2=2, U32=\"\",V32=\"\",W32<>\"\"),利用申込書1!$AD$52,\"\")","v":""},"0号室"]
[null,{"$f":"IF(T32=0,\"\",IF(VLOOKUP(T32,DATA!$B$28:$P$49,15,FALSE)>利用申込書1!$Y$23,利用申込書1!$Y$23,VLOOKUP(T32,DATA!$B$28:$P$49,15,FALSE)))","v":""},{"$f":"PG!$H$1","v":"：～："},{"$f":"CHOOSE(PG!H47,VLOOKUP(S32,DATA!$A$129:$N$151,3,FALSE),VLOOKUP(S32,DATA!$A$129:$N$151,4,FALSE),VLOOKUP(S32,DATA!$A$129:$N$151,5,FALSE),VLOOKUP(S32,DATA!$A$129:$N$151,6,FALSE),VLOOKUP(S32,DATA!$A$129:$N$151,7,FALSE),VLOOKUP(S32,DATA!$A$129:$N$151,8,FALSE),VLOOKUP(S32,DATA!$A$129:$N$151,9,FALSE),VLOOKUP(S32,DATA!$A$129:$N$151,10,FALSE),VLOOKUP(S32,DATA!$A$129:$N$151,11,FALSE),VLOOKUP(S32,DATA!$A$129:$N$151,12,FALSE),VLOOKUP(S32,DATA!$A$129:$N$151,13,FALSE),VLOOKUP(S32,DATA!$A$129:$N$151,14,FALSE),\"\")","v":{"$error":"#N/A"}},null,null,{"$f":"IF(利用申込書2!$A$14=\"\",$R$29,利用申込書2!$A$14)","v":"1月0日"},{"$f":"H32","v":0},null,null,null,null,null,null,null,null,null,{"$f":"R32","v":"1月0日"},{"$f":"S32","v":0},null,null,null,null,null,null,null,null,null,null,null,null,null,"0号室"]
[null,{"$f":"IF(T35=0,\"\",VLOOKUP(T35,DATA!$B$28:$O$49,14,FALSE))","v":""},{"$f":"IF(OR(B35=\"ピアザH(準)\",B35=\"大会議室(準)\"),\"準備(掲示なし)\",IF(AND(R32=R35, B32<>\"ピアザH(準)\"),\"同上\",利用申込書1!$F$21))","v":"同上"},{"$f":"PG!$O$51","v":"夜間"},null,null,{"$f":"IF(利用申込書2!$A$16=\"\",$R$32,利用申込書2!$A$16)","v":"1月0日"},{"$f":"VLOOKUP(T35,DATA!$B$2:$O$25,14,FALSE)","v":0},null,{"$f":"利用申込書2!AG16","v":""},{"$f":"VLOOKUP($S35,$B$130:$D$151,3,FALSE)","v":{"$error":"#N/A"}},null,null,null,null,null,{"$f":"IF(S35=102,101,IF(S35=209,208,S35))","v":0},{"$f":"PG!V52","v":"1月0日"},{"$f":"VLOOKUP(T35,DATA!$B$2:$O$25,14,FALSE)","v":0},{"$f":"PG!D51","v":0},{"$f":"IF(利用申込書2!M16=\"\",利用申込書2!R16,利用申込書2!R16+利用申込書2!M16)","v":""},{"$f":"利用申込書2!W16","v":""},{"$f":"利用申込書2!AB16","v":""},{"$f":"IF(U35=\"\",0,IF(OR($B35=\"ピアザH(準)\",$B35=\"大会議室(準)\"),7,IF(OR(PG!$I$2<12,PG!$I$2=12),B37,3)))","v":0},{"$f":"IF(V35=\"\",0,IF(OR($B35=\"ピアザH(準)\",$B35=\"大会議室(準)\"),7,IF(OR(PG!$J$2<13,PG!$J$2=13),3,$B37)))","v":0},{"$f":"IF(W35=\"\",0,IF(OR($B35=\"ピアザH(準)\",$B35=\"大会議室(準)\"),7,IF(PG!$J$2<18,3,$B37)))","v":0},{"$f":"IF(AND($P$2=1,U35<>\"\"),利用申込書1!$Z$52,\"\")","v":""},{"$f":"IF(AND($P$2=1,U35<>\"\"),利用申込書1!$AD$52,\"\")","v":""},{"$f":"IF(AND($P$2=1,U35=\"\",V35<>\"\"),利用申込書1!$Z$52,\"\")","v":""},{"$f":"IF(AND($P$2=1, U35=\"\",V35<>\"\"),利用申込書1!$AD$52,\"\")","v":""},{"$f":"IF(AND($P$2=1,U35=\"\",V35=\"\",W35<>\"\"),利用申込書1!$Z$52,\"\")","v":""},{"$f":"IF(AND($P$2=1, U35=\"\",V35=\"\",W35<>\"\"),利用申込書1!$AD$52,\"\")","v":""},"0号室"]
[null,null,{"$f":"IF(R36=R32,\"\",$C$3)","v":""},{"$f":"PG!$Q$51","v":"18:00-21:00"},null,null,{"$f":"IF(利用申込書2!$A$16=\"\",$R$32,利用申込書2!$A$16)","v":"1月0日"},{"$f":"H35","v":0},null,null,null,null,null,null,null,null,{"$f":"Q35+0.3","v":0.3},{"$f":"R35","v":"1月0日"},{"$f":"S35","v":0},null,null,null,null,null,null,null,{"$f":"IF(AND($P$2=2,U35<>\"\"),利用申込書1!$Z$52,\"\")","v":""},{"$f":"IF(AND($P$2=2,U35<>\"\"),利用申込書1!$AD$52,\"\")","v":""},{"$f":"IF(AND($P$2=2,U35=\"\",V35<>\"\"),利用申込書1!$Z$52,\"\")","v":""},{"$f":"IF(AND($P$2=2,U35=\"\",V35<>\"\"),利用申込書1!$AD$52,\"\")","v":""},{"$f":"IF(AND($P$2=2,U35=\"\",V35=\"\",W35<>\"\"),利用申込書1!$Z$52,\"\")","v":""},{"$f":"IF(AND($P$2=2, U35=\"\",V35=\"\",W35<>\"\"),利用申込書1!$AD$52,\"\")","v":""},"0号室"]
[null,{"$f":"IF(T35=0,\"\",IF(VLOOKUP(T35,DATA!$B$28:$P$49,15,FALSE)>利用申込書1!$Y$23,利用申込書1!$Y$23,VLOOKUP(T35,DATA!$B$28:$P$49,15,FALSE)))","v":""},{"$f":"PG!$H$1","v":"：～："},{"$f":"CHOOSE(PG!H51,VLOOKUP(S35,DATA!$A$129:$N$151,3,FALSE),VLOOKUP(S35,DATA!$A$129:$N$151,4,FALSE),VLOOKUP(S35,DATA!$A$129:$N$151,5,FALSE),VLOOKUP(S35,DATA!$A$129:$N$151,6,FALSE),VLOOKUP(S35,DATA!$A$129:$N$151,7,FALSE),VLOOKUP(S35,DATA!$A$129:$N$151,8,FALSE),VLOOKUP(S35,DATA!$A$129:$N$151,9,FALSE),VLOOKUP(S35,DATA!$A$129:$N$151,10,FALSE),VLOOKUP(S35,DATA!$A$129:$N$151,11,FALSE),VLOOKUP(S35,DATA!$A$129:$N$151,12,FALSE),VLOOKUP(S35,DATA!$A$129:$N$151,13,FALSE),VLOOKUP(S35,DATA!$A$129:$N$151,14,FALSE),\"\")","v":{"$error":"#N/A"}},null,null,{"$f":"IF(利用申込書2!$A$16=\"\",$R$32,利用申込書2!$A$16)","v":"1月0日"},{"$f":"H35","v":0},null,null,null,null,null,null,null,null,null,{"$f":"R35","v":"1月0日"},{"$f":"S35","v":0},null,null,null,null,null,null,null,null,null,null,null,null,null,"0号室"]
[null,{"$f":"IF(T38=0,\"\",VLOOKUP(T38,DATA!$B$28:$O$49,14,FALSE))","v":""},{"$f":"IF(OR(B38=\"ピアザH(準)\",B38=\"大会議室(準)\"),\"準備(掲示なし)\",IF(AND(R35=R38, B35<>\"ピアザH(準)\"),\"同上\",利用申込書1!$F$21))","v":"同上"},{"$f":"PG!$O$55","v":"夜間"},null,null,{"$f":"IF(利用申込書2!$A$18=\"\",$R$35,利用申込書2!$A$18)","v":"1月0日"},{"$f":"VLOOKUP(T38,DATA!$B$2:$O$25,14,FALSE)","v":0},null,{"$f":"利用申込書2!AG18","v":""},{"$f":"VLOOKUP($S38,$B$130:$D$151,3,FALSE)","v":{"$error":"#N/A"}},null,null,null,null,null,{"$f":"IF(S38=102,101,IF(S38=209,208,S38))","v":0},{"$f":"PG!V56","v":"1月0日"},{"$f":"VLOOKUP(T38,DATA!$B$2:$O$25,14,FALSE)","v":0},{"$f":"PG!D55","v":0},{"$f":"IF(利用申込書2!M18=\"\",利用申込書2!R18,利用申込書2!R18+利用申込書2!M18)","v":""},{"$f":"利用申込書2!W18","v":""},{"$f":"利用申込書2!AB18","v":""},{"$f":"IF(U38=\"\",0,IF(OR($B38=\"ピアザH(準)\",$B38=\"大会議室(準)\"),7,IF(OR(PG!$I$2<12,PG!$I$2=12),B40,3)))","v":0},{"$f":"IF(V38=\"\",0,IF(OR($B38=\"ピアザH(準)\",$B38=\"大会議室(準)\"),7,IF(OR(PG!$J$2<13,PG!$J$2=13),3,$B40)))","v":0},{"$f":"IF(W38=\"\",0,IF(OR($B38=\"ピアザH(準)\",$B38=\"大会議室(準)\"),7,IF(PG!$J$2<18,3,$B40)))","v":0},{"$f":"IF(AND($P$2=1,U38<>\"\"),利用申込書1!$Z$52,\"\")","v":""},{"$f":"IF(AND($P$2=1,U38<>\"\"),利用申込書1!$AD$52,\"\")","v":""},{"$f":"IF(AND($P$2=1,U38=\"\",V38<>\"\"),利用申込書1!$Z$52,\"\")","v":""},{"$f":"IF(AND($P$2=1, U38=\"\",V38<>\"\"),利用申込書1!$AD$52,\"\")","v":""},{"$f":"IF(AND($P$2=1,U38=\"\",V38=\"\",W38<>\"\"),利用申込書1!$Z$52,\"\")","v":""},{"$f":"IF(AND($P$2=1, U38=\"\",V38=\"\",W38<>\"\"),利用申込書1!$AD$52,\"\")","v":""},"0号室"]
[null,null,{"$f":"IF(R39=R35,\"\",$C$3)","v":""},{"$f":"PG!$Q$55","v":"18:00-21:00"},null,null,{"$f":"IF(利用申込書2!$A$18=\"\",$R$35,利用申込書2!$A$18)","v":"1月0日"},{"$f":"H38","v":0},null,null,null,null,null,null,null,null,{"$f":"Q38+0.3","v":0.3},{"$f":"R38","v":"1月0日"},{"$f":"S38","v":0},null,null,null,null,null,null,null,{"$f":"IF(AND($P$2=2,U38<>\"\"),利用申込書1!$Z$52,\"\")","v":""},{"$f":"IF(AND($P$2=2,U38<>\"\"),利用申込書1!$AD$52,\"\")","v":""},{"$f":"IF(AND($P$2=2,U38=\"\",V38<>\"\"),利用申込書1!$Z$52,\"\")","v":""},{"$f":"IF(AND($P$2=2,U38=\"\",V38<>\"\"),利用申込書1!$AD$52,\"\")","v":""},{"$f":"IF(AND($P$2=2,U38=\"\",V38=\"\",W38<>\"\"),利用申込書1!$Z$52,\"\")","v":""},{"$f":"IF(AND($P$2=2, U38=\"\",V38=\"\",W38<>\"\"),利用申込書1!$AD$52,\"\")","v":""},{"$f":"S39&\"号室\"","v":"0号室"}]
[null,{"$f":"IF(T38=0,\"\",IF(VLOOKUP(T38,DATA!$B$28:$P$49,15,FALSE)>利用申込書1!$Y$23,利用申込書1!$Y$23,VLOOKUP(T38,DATA!$B$28:$P$49,15,FALSE)))","v":""},{"$f":"PG!$H$1","v":"：～："},{"$f":"CHOOSE(PG!H55,VLOOKUP(S38,DATA!$A$129:$N$151,3,FALSE),VLOOKUP(S38,DATA!$A$129:$N$151,4,FALSE),VLOOKUP(S38,DATA!$A$129:$N$151,5,FALSE),VLOOKUP(S38,DATA!$A$129:$N$151,6,FALSE),VLOOKUP(S38,DATA!$A$129:$N$151,7,FALSE),VLOOKUP(S38,DATA!$A$129:$N$151,8,FALSE),VLOOKUP(S38,DATA!$A$129:$N$151,9,FALSE),VLOOKUP(S38,DATA!$A$129:$N$151,10,FALSE),VLOOKUP(S38,DATA!$A$129:$N$151,11,FALSE),VLOOKUP(S38,DATA!$A$129:$N$151,12,FALSE),VLOOKUP(S38,DATA!$A$129:$N$151,13,FALSE),VLOOKUP(S38,DATA!$A$129:$N$151,14,FALSE),\"\")","v":{"$error":"#N/A"}},null,null,{"$f":"IF(利用申込書2!$A$18=\"\",$R$35,利用申込書2!$A$18)","v":"1月0日"},{"$f":"H38","v":0},null,null,null,null,null,null,null,null,null,{"$f":"R38","v":"1月0日"},{"$f":"S38","v":0},null,null,null,null,null,null,null,null,null,null,null,null,null,"0号室"]
[null,{"$f":"IF(T41=0,\"\",VLOOKUP(T41,DATA!$B$28:$O$49,14,FALSE))","v":""},{"$f":"IF(OR(B41=\"ピアザH(準)\",B41=\"大会議室(準)\"),\"準備(掲示なし)\",IF(AND(R38=R41, B38<>\"ピアザH(準)\"),\"同上\",利用申込書1!$F$21))","v":"同上"},{"$f":"PG!$O$59","v":"夜間"},null,null,{"$f":"IF(利用申込書2!$A$20=\"\",$R$38,利用申込書2!$A$20)","v":"1月0日"},{"$f":"VLOOKUP(T41,DATA!$B$2:$O$25,14,FALSE)","v":0},null,{"$f":"利用申込書2!AG20","v":""},{"$f":"VLOOKUP($S41,$B$130:$D$151,3,FALSE)","v":{"$error":"#N/A"}},null,null,null,null,null,{"$f":"IF(S41=102,101,IF(S41=209,208,S41))","v":0},{"$f":"PG!V60","v":"1月0日"},{"$f":"VLOOKUP(T41,DATA!$B$2:$O$25,14,FALSE)","v":0},{"$f":"PG!D59","v":0},{"$f":"IF(利用申込書2!M20=\"\",利用申込書2!R20,利用申込書2!R20+利用申込書2!M20)","v":""},{"$f":"利用申込書2!W20","v":""},{"$f":"利用申込書2!AB20","v":""},{"$f":"IF(U41=\"\",0,IF(OR($B41=\"ピアザH(準)\",$B41=\"大会議室(準)\"),7,IF(OR(PG!$I$2<12,PG!$I$2=12),B43,3)))","v":0},{"$f":"IF(V41=\"\",0,IF(OR($B41=\"ピアザH(準)\",$B41=\"大会議室(準)\"),7,IF(OR(PG!$J$2<13,PG!$J$2=13),3,$B43)))","v":0},{"$f":"IF(W41=\"\",0,IF(OR($B41=\"ピアザH(準)\",$B41=\"大会議室(準)\"),7,IF(PG!$J$2<18,3,$B43)))","v":0},{"$f":"IF(AND($P$2=1,U41<>\"\"),利用申込書1!$Z$52,\"\")","v":""},{"$f":"IF(AND($P$2=1,U41<>\"\"),利用申込書1!$AD$52,\"\")","v":""},{"$f":"IF(AND($P$2=1,U41=\"\",V41<>\"\"),利用申込書1!$Z$52,\"\")","v":""},{"$f":"IF(AND($P$2=1, U41=\"\",V41<>\"\"),利用申込書1!$AD$52,\"\")","v":""},{"$f":"IF(AND($P$2=1,U41=\"\",V41=\"\",W41<>\"\"),利用申込書1!$Z$52,\"\")","v":""},{"$f":"IF(AND($P$2=1, U41=\"\",V41=\"\",W41<>\"\"),利用申込書1!$AD$52,\"\")","v":""},"0号室"]
[null,null,{"$f":"IF(R42=R38,\"\",$C$3)","v":""},{"$f":"PG!$Q$59","v":"18:00-21:00"},null,null,{"$f":"IF(利用申込書2!$A$20=\"\",$R$38,利用申込書2!$A$20)","v":"1月0日"},{"$f":"H41","v":0},null,null,null,null,null,null,null,null,{"$f":"Q41+0.3","v":0.3},{"$f":"R41","v":"1月0日"},{"$f":"S41","v":0},null,null,null,null,null,null,null,{"$f":"IF(AND($P$2=2,U41<>\"\"),利用申込書1!$Z$52,\"\")","v":""},{"$f":"IF(AND($P$2=2,U41<>\"\"),利用申込書1!$AD$52,\"\")","v":""},{"$f":"IF(AND($P$2=2,U41=\"\",V41<>\"\"),利用申込書1!$Z$52,\"\")","v":""},{"$f":"IF(AND($P$2=2,U41=\"\",V41<>\"\"),利用申込書1!$AD$52,\"\")","v":""},{"$f":"IF(AND($P$2=2,U41=\"\",V41=\"\",W41<>\"\"),利用申込書1!$Z$52,\"\")","v":""},{"$f":"IF(AND($P$2=2, U41=\"\",V41=\"\",W41<>\"\"),利用申込書1!$AD$52,\"\")","v":""},"0号室"]
[null,{"$f":"IF(T41=0,\"\",IF(VLOOKUP(T41,DATA!$B$28:$P$49,15,FALSE)>利用申込書1!$Y$23,利用申込書1!$Y$23,VLOOKUP(T41,DATA!$B$28:$P$49,15,FALSE)))","v":""},{"$f":"PG!$H$1","v":"：～："},{"$f":"CHOOSE(PG!H59,VLOOKUP(S41,DATA!$A$129:$N$151,3,FALSE),VLOOKUP(S41,DATA!$A$129:$N$151,4,FALSE),VLOOKUP(S41,DATA!$A$129:$N$151,5,FALSE),VLOOKUP(S41,DATA!$A$129:$N$151,6,FALSE),VLOOKUP(S41,DATA!$A$129:$N$151,7,FALSE),VLOOKUP(S41,DATA!$A$129:$N$151,8,FALSE),VLOOKUP(S41,DATA!$A$129:$N$151,9,FALSE),VLOOKUP(S41,DATA!$A$129:$N$151,10,FALSE),VLOOKUP(S41,DATA!$A$129:$N$151,11,FALSE),VLOOKUP(S41,DATA!$A$129:$N$151,12,FALSE),VLOOKUP(S41,DATA!$A$129:$N$151,13,FALSE),VLOOKUP(S41,DATA!$A$129:$N$151,14,FALSE),\"\")","v":{"$error":"#N/A"}},null,null,{"$f":"IF(利用申込書2!$A$20=\"\",$R$38,利用申込書2!$A$20)","v":"1月0日"},{"$f":"H41","v":0},null,null,null,null,null,null,null,null,null,{"$f":"R41","v":"1月0日"},{"$f":"S41","v":0},null,null,null,null,null,null,null,null,null,null,null,null,null,"0号室"]
[null,{"$f":"IF(T44=0,\"\",VLOOKUP(T44,DATA!$B$28:$O$49,14,FALSE))","v":""},{"$f":"IF(OR(B44=\"ピアザH(準)\",B44=\"大会議室(準)\"),\"準備(掲示なし)\",IF(AND(R41=R44, B41<>\"ピアザH(準)\"),\"同上\",利用申込書1!$F$21))","v":"同上"},{"$f":"PG!$O$63","v":"夜間"},null,null,{"$f":"IF(利用申込書2!$A$22=\"\",$R$41,利用申込書2!$A$22)","v":"1月0日"},{"$f":"VLOOKUP(T44,DATA!$B$2:$O$25,14,FALSE)","v":0},null,{"$f":"利用申込書2!AG22","v":""},{"$f":"VLOOKUP($S44,$B$130:$D$151,3,FALSE)","v":{"$error":"#N/A"}},null,null,null,null,null,{"$f":"IF(S44=102,101,IF(S44=209,208,S44))","v":0},{"$f":"PG!V64","v":"1月0日"},{"$f":"VLOOKUP(T44,DATA!$B$2:$O$25,14,FALSE)","v":0},{"$f":"PG!D63","v":0},{"$f":"IF(利用申込書2!M22=\"\",利用申込書2!R22,利用申込書2!R22+利用申込書2!M22)","v":""},{"$f":"利用申込書2!W22","v":""},{"$f":"利用申込書2!AB22","v":""},{"$f":"IF(U44=\"\",0,IF(OR($B44=\"ピアザH(準)\",$B44=\"大会議室(準)\"),7,IF(OR(PG!$I$2<12,PG!$I$2=12),B46,3)))","v":0},{"$f":"IF(V44=\"\",0,IF(OR($B44=\"ピアザH(準)\",$B44=\"大会議室(準)\"),7,IF(OR(PG!$J$2<13,PG!$J$2=13),3,$B46)))","v":0},{"$f":"IF(W44=\"\",0,IF(OR($B44=\"ピアザH(準)\",$B44=\"大会議室(準)\"),7,IF(PG!$J$2<18,3,$B46)))","v":0},{"$f":"IF(AND($P$2=1,U44<>\"\"),利用申込書1!$Z$52,\"\")","v":""},{"$f":"IF(AND($P$2=1,U44<>\"\"),利用申込書1!$AD$52,\"\")","v":""},{"$f":"IF(AND($P$2=1,U44=\"\",V44<>\"\"),利用申込書1!$Z$52,\"\")","v":""},{"$f":"IF(AND($P$2=1, U44=\"\",V44<>\"\"),利用申込書1!$AD$52,\"\")","v":""},{"$f":"IF(AND($P$2=1,U44=\"\",V44=\"\",W44<>\"\"),利用申込書1!$Z$52,\"\")","v":""},{"$f":"IF(AND($P$2=1, U44=\"\",V44=\"\",W44<>\"\"),利用申込書1!$AD$52,\"\")","v":""},"0号室"]
[null,null,{"$f":"IF(R45=R41,\"\",$C$3)","v":""},{"$f":"PG!$Q$63","v":"18:00-21:00"},null,null,{"$f":"IF(利用申込書2!$A$22=\"\",$R$41,利用申込書2!$A$22)","v":"1月0日"},{"$f":"H44","v":0},null,null,null,null,null,null,null,null,{"$f":"Q44+0.3","v":0.3},{"$f":"R44","v":"1月0日"},{"$f":"S44","v":0},null,null,null,null,null,null,null,{"$f":"IF(AND($P$2=2,U44<>\"\"),利用申込書1!$Z$52,\"\")","v":""},{"$f":"IF(AND($P$2=2,U44<>\"\"),利用申込書1!$AD$52,\"\")","v":""},{"$f":"IF(AND($P$2=2,U44=\"\",V44<>\"\"),利用申込書1!$Z$52,\"\")","v":""},{"$f":"IF(AND($P$2=2,U44=\"\",V44<>\"\"),利用申込書1!$AD$52,\"\")","v":""},{"$f":"IF(AND($P$2=2,U44=\"\",V44=\"\",W44<>\"\"),利用申込書1!$Z$52,\"\")","v":""},{"$f":"IF(AND($P$2=2, U44=\"\",V44=\"\",W44<>\"\"),利用申込書1!$AD$52,\"\")","v":""},"0号室"]
[null,{"$f":"IF(T44=0,\"\",IF(VLOOKUP(T44,DATA!$B$28:$P$49,15,FALSE)>利用申込書1!$Y$23,利用申込書1!$Y$23,VLOOKUP(T44,DATA!$B$28:$P$49,15,FALSE)))","v":""},{"$f":"PG!$H$1","v":"：～："},{"$f":"CHOOSE(PG!H63,VLOOKUP(S44,DATA!$A$129:$N$151,3,FALSE),VLOOKUP(S44,DATA!$A$129:$N$151,4,FALSE),VLOOKUP(S44,DATA!$A$129:$N$151,5,FALSE),VLOOKUP(S44,DATA!$A$129:$N$151,6,FALSE),VLOOKUP(S44,DATA!$A$129:$N$151,7,FALSE),VLOOKUP(S44,DATA!$A$129:$N$151,8,FALSE),VLOOKUP(S44,DATA!$A$129:$N$151,9,FALSE),VLOOKUP(S44,DATA!$A$129:$N$151,10,FALSE),VLOOKUP(S44,DATA!$A$129:$N$151,11,FALSE),VLOOKUP(S44,DATA!$A$129:$N$151,12,FALSE),VLOOKUP(S44,DATA!$A$129:$N$151,13,FALSE),VLOOKUP(S44,DATA!$A$129:$N$151,14,FALSE),\"\")","v":{"$error":"#N/A"}},null,null,{"$f":"IF(利用申込書2!$A$22=\"\",$R$41,利用申込書2!$A$22)","v":"1月0日"},{"$f":"H44","v":0},null,null,null,null,null,null,null,null,null,{"$f":"R44","v":"1月0日"},{"$f":"S44","v":0},null,null,null,null,null,null,null,null,null,null,null,null,null,"0号室"]
[null,{"$f":"IF(T47=0,\"\",VLOOKUP(T47,DATA!$B$28:$O$49,14,FALSE))","v":""},{"$f":"IF(OR(B47=\"ピアザH(準)\",B47=\"大会議室(準)\"),\"準備(掲示なし)\",IF(AND(R44=R47, B44<>\"ピアザH(準)\"),\"同上\",利用申込書1!$F$21))","v":"同上"},{"$f":"PG!$O$67","v":"夜間"},null,null,{"$f":"IF(利用申込書2!$A$24=\"\",$R$44,利用申込書2!$A$24)","v":"1月0日"},{"$f":"VLOOKUP(T47,DATA!$B$2:$O$25,14,FALSE)","v":0},null,{"$f":"利用申込書2!AG24","v":""},{"$f":"VLOOKUP($S47,$B$130:$D$151,3,FALSE)","v":{"$error":"#N/A"}},null,null,null,null,null,{"$f":"IF(S47=102,101,IF(S47=209,208,S47))","v":0},{"$f":"PG!V68","v":"1月0日"},{"$f":"VLOOKUP(T47,DATA!$B$2:$O$25,14,FALSE)","v":0},{"$f":"PG!D67","v":0},{"$f":"IF(利用申込書2!M24=\"\",利用申込書2!R24,利用申込書2!R24+利用申込書2!M24)","v":""},{"$f":"利用申込書2!W24","v":""},{"$f":"利用申込書2!AB24","v":""},{"$f":"IF(U47=\"\",0,IF(OR($B47=\"ピアザH(準)\",$B47=\"大会議室(準)\"),7,IF(OR(PG!$I$2<12,PG!$I$2=12),B49,3)))","v":0},{"$f":"IF(V47=\"\",0,IF(OR($B47=\"ピアザH(準)\",$B47=\"大会議室(準)\"),7,IF(OR(PG!$J$2<13,PG!$J$2=13),3,$B49)))","v":0},{"$f":"IF(W47=\"\",0,IF(OR($B47=\"ピアザH(準)\",$B47=\"大会議室(準)\"),7,IF(PG!$J$2<18,3,$B49)))","v":0},{"$f":"IF(AND($P$2=1,U47<>\"\"),利用申込書1!$Z$52,\"\")","v":""},{"$f":"IF(AND($P$2=1,U47<>\"\"),利用申込書1!$AD$52,\"\")","v":""},{"$f":"IF(AND($P$2=1,U47=\"\",V47<>\"\"),利用申込書1!$Z$52,\"\")","v":""},{"$f":"IF(AND($P$2=1, U47=\"\",V47<>\"\"),利用申込書1!$AD$52,\"\")","v":""},{"$f":"IF(AND($P$2=1,U47=\"\",V47=\"\",W47<>\"\"),利用申込書1!$Z$52,\"\")","v":""},{"$f":"IF(AND($P$2=1, U47=\"\",V47=\"\",W47<>\"\"),利用申込書1!$AD$52,\"\")","v":""},"0号室"]
[null,null,{"$f":"IF(R48=R44,\"\",$C$3)","v":""},{"$f":"PG!$Q$67","v":"18:00-21:00"},null,null,{"$f":"IF(利用申込書2!$A$24=\"\",$R$44,利用申込書2!$A$24)","v":"1月0日"},{"$f":"H47","v":0},null,null,null,null,null,null,null,null,{"$f":"Q47+0.3","v":0.3},{"$f":"R47","v":"1月0日"},{"$f":"S47","v":0},null,null,null,null,null,null,null,{"$f":"IF(AND($P$2=2,U47<>\"\"),利用申込書1!$Z$52,\"\")","v":""},{"$f":"IF(AND($P$2=2,U47<>\"\"),利用申込書1!$AD$52,\"\")","v":""},{"$f":"IF(AND($P$2=2,U47=\"\",V47<>\"\"),利用申込書1!$Z$52,\"\")","v":""},{"$f":"IF(AND($P$2=2,U47=\"\",V47<>\"\"),利用申込書1!$AD$52,\"\")","v":""},{"$f":"IF(AND($P$2=2,U47=\"\",V47=\"\",W47<>\"\"),利用申込書1!$Z$52,\"\")","v":""},{"$f":"IF(AND($P$2=2, U47=\"\",V47=\"\",W47<>\"\"),利用申込書1!$AD$52,\"\")","v":""},"0号室"]
[null,{"$f":"IF(T47=0,\"\",IF(VLOOKUP(T47,DATA!$B$28:$P$49,15,FALSE)>利用申込書1!$Y$23,利用申込書1!$Y$23,VLOOKUP(T47,DATA!$B$28:$P$49,15,FALSE)))","v":""},{"$f":"PG!$H$1","v":"：～："},{"$f":"CHOOSE(PG!H67,VLOOKUP(S47,DATA!$A$129:$N$151,3,FALSE),VLOOKUP(S47,DATA!$A$129:$N$151,4,FALSE),VLOOKUP(S47,DATA!$A$129:$N$151,5,FALSE),VLOOKUP(S47,DATA!$A$129:$N$151,6,FALSE),VLOOKUP(S47,DATA!$A$129:$N$151,7,FALSE),VLOOKUP(S47,DATA!$A$129:$N$151,8,FALSE),VLOOKUP(S47,DATA!$A$129:$N$151,9,FALSE),VLOOKUP(S47,DATA!$A$129:$N$151,10,FALSE),VLOOKUP(S47,DATA!$A$129:$N$151,11,FALSE),VLOOKUP(S47,DATA!$A$129:$N$151,12,FALSE),VLOOKUP(S47,DATA!$A$129:$N$151,13,FALSE),VLOOKUP(S47,DATA!$A$129:$N$151,14,FALSE),\"\")","v":{"$error":"#N/A"}},null,null,{"$f":"IF(利用申込書2!$A$24=\"\",$R$44,利用申込書2!$A$24)","v":"1月0日"},{"$f":"H47","v":0},null,null,null,null,null,null,null,null,null,{"$f":"R47","v":"1月0日"},{"$f":"S47","v":0},null,null,null,null,null,null,null,null,null,null,null,null,null,"0号室"]
[null,{"$f":"IF(T50=0,\"\",VLOOKUP(T50,DATA!$B$28:$O$49,14,FALSE))","v":""},{"$f":"IF(OR(B50=\"ピアザH(準)\",B50=\"大会議室(準)\"),\"準備(掲示なし)\",IF(AND(R47=R50, B47<>\"ピアザH(準)\"),\"同上\",利用申込書1!$F$21))","v":"同上"},{"$f":"PG!$O$71","v":"夜間"},null,null,{"$f":"IF(利用申込書2!$A$26=\"\",$R$47,利用申込書2!$A$26)","v":"1月0日"},{"$f":"VLOOKUP(T50,DATA!$B$2:$O$25,14,FALSE)","v":0},null,{"$f":"利用申込書2!AG26","v":""},{"$f":"VLOOKUP($S50,$B$130:$D$151,3,FALSE)","v":{"$error":"#N/A"}},null,null,null,null,null,{"$f":"IF(S50=102,101,IF(S50=209,208,S50))","v":0},{"$f":"PG!V72","v":"1月0日"},{"$f":"VLOOKUP(T50,DATA!$B$2:$O$25,14,FALSE)","v":0},{"$f":"PG!D71","v":0},{"$f":"IF(利用申込書2!M26=\"\",利用申込書2!R26,利用申込書2!R26+利用申込書2!M26)","v":""},{"$f":"利用申込書2!W26","v":""},{"$f":"利用申込書2!AB26","v":""},{"$f":"IF(U50=\"\",0,IF(OR($B50=\"ピアザH(準)\",$B50=\"大会議室(準)\"),7,IF(OR(PG!$I$2<12,PG!$I$2=12),B52,3)))","v":0},{"$f":"IF(V50=\"\",0,IF(OR($B50=\"ピアザH(準)\",$B50=\"大会議室(準)\"),7,IF(OR(PG!$J$2<13,PG!$J$2=13),3,$B52)))","v":0},{"$f":"IF(W50=\"\",0,IF(OR($B50=\"ピアザH(準)\",$B50=\"大会議室(準)\"),7,IF(PG!$J$2<18,3,$B52)))","v":0},{"$f":"IF(AND($P$2=1,U50<>\"\"),利用申込書1!$Z$52,\"\")","v":""},{"$f":"IF(AND($P$2=1,U50<>\"\"),利用申込書1!$AD$52,\"\")","v":""},{"$f":"IF(AND($P$2=1,U50=\"\",V50<>\"\"),利用申込書1!$Z$52,\"\")","v":""},{"$f":"IF(AND($P$2=1, U50=\"\",V50<>\"\"),利用申込書1!$AD$52,\"\")","v":""},{"$f":"IF(AND($P$2=1,U50=\"\",V50=\"\",W50<>\"\"),利用申込書1!$Z$52,\"\")","v":""},{"$f":"IF(AND($P$2=1, U50=\"\",V50=\"\",W50<>\"\"),利用申込書1!$AD$52,\"\")","v":""},"0号室"]
[null,null,{"$f":"IF(R51=R47,\"\",$C$3)","v":""},{"$f":"PG!$Q$71","v":"18:00-21:00"},null,null,{"$f":"IF(利用申込書2!$A$26=\"\",$R$47,利用申込書2!$A$26)","v":"1月0日"},{"$f":"H50","v":0},null,null,null,null,null,null,null,null,{"$f":"Q50+0.3","v":0.3},{"$f":"R50","v":"1月0日"},{"$f":"S50","v":0},null,null,null,null,null,null,null,{"$f":"IF(AND($P$2=2,U50<>\"\"),利用申込書1!$Z$52,\"\")","v":""},{"$f":"IF(AND($P$2=2,U50<>\"\"),利用申込書1!$AD$52,\"\")","v":""},{"$f":"IF(AND($P$2=2,U50=\"\",V50<>\"\"),利用申込書1!$Z$52,\"\")","v":""},{"$f":"IF(AND($P$2=2,U50=\"\",V50<>\"\"),利用申込書1!$AD$52,\"\")","v":""},{"$f":"IF(AND($P$2=2,U50=\"\",V50=\"\",W50<>\"\"),利用申込書1!$Z$52,\"\")","v":""},{"$f":"IF(AND($P$2=2, U50=\"\",V50=\"\",W50<>\"\"),利用申込書1!$AD$52,\"\")","v":""},"0号室"]
[null,{"$f":"IF(T50=0,\"\",IF(VLOOKUP(T50,DATA!$B$28:$P$49,15,FALSE)>利用申込書1!$Y$23,利用申込書1!$Y$23,VLOOKUP(T50,DATA!$B$28:$P$49,15,FALSE)))","v":""},{"$f":"PG!$H$1","v":"：～："},{"$f":"CHOOSE(PG!H64,VLOOKUP(S50,DATA!$A$129:$N$151,3,FALSE),VLOOKUP(S50,DATA!$A$129:$N$151,4,FALSE),VLOOKUP(S50,DATA!$A$129:$N$151,5,FALSE),VLOOKUP(S50,DATA!$A$129:$N$151,6,FALSE),VLOOKUP(S50,DATA!$A$129:$N$151,7,FALSE),VLOOKUP(S50,DATA!$A$129:$N$151,8,FALSE),VLOOKUP(S50,DATA!$A$129:$N$151,9,FALSE),VLOOKUP(S50,DATA!$A$129:$N$151,10,FALSE),VLOOKUP(S50,DATA!$A$129:$N$151,11,FALSE),VLOOKUP(S50,DATA!$A$129:$N$151,12,FALSE),VLOOKUP(S50,DATA!$A$129:$N$151,13,FALSE),VLOOKUP(S50,DATA!$A$129:$N$151,14,FALSE),\"\")","v":{"$error":"#VALUE!"}},null,null,{"$f":"IF(利用申込書2!$A$26=\"\",$R$47,利用申込書2!$A$26)","v":"1月0日"},{"$f":"H50","v":0},null,null,null,null,null,null,null,null,null,{"$f":"R50","v":"1月0日"},{"$f":"S50","v":0},null,null,null,null,null,null,null,null,null,null,null,null,null,"0号室"]
[null,{"$f":"IF(T53=0,\"\",VLOOKUP(T53,DATA!$B$28:$O$49,14,FALSE))","v":""},{"$f":"IF(OR(B53=\"ピアザH(準)\",B53=\"大会議室(準)\"),\"準備(掲示なし)\",IF(AND(R50=R53, B50<>\"ピアザH(準)\"),\"同上\",利用申込書1!$F$21))","v":"同上"},{"$f":"PG!$O$75","v":"夜間"},null,null,{"$f":"IF(利用申込書2!$A$28=\"\",$R$50,利用申込書2!$A$28)","v":"1月0日"},{"$f":"VLOOKUP(T53,DATA!$B$2:$O$25,14,FALSE)","v":0},null,{"$f":"利用申込書2!AG28","v":""},{"$f":"VLOOKUP($S53,$B$130:$D$151,3,FALSE)","v":{"$error":"#N/A"}},null,null,null,null,null,{"$f":"IF(S53=102,101,IF(S53=209,208,S53))","v":0},{"$f":"PG!V76","v":"1月0日"},{"$f":"VLOOKUP(T53,DATA!$B$2:$O$25,14,FALSE)","v":0},{"$f":"PG!D75","v":0},{"$f":"IF(利用申込書2!M28=\"\",利用申込書2!R28,利用申込書2!R28+利用申込書2!M28)","v":""},{"$f":"利用申込書2!W28","v":""},{"$f":"利用申込書2!AB28","v":""},{"$f":"IF(U53=\"\",0,IF(OR($B53=\"ピアザH(準)\",$B53=\"大会議室(準)\"),7,IF(OR(PG!$I$2<12,PG!$I$2=12),B55,3)))","v":0},{"$f":"IF(V53=\"\",0,IF(OR($B53=\"ピアザH(準)\",$B53=\"大会議室(準)\"),7,IF(OR(PG!$J$2<13,PG!$J$2=13),3,$B55)))","v":0},{"$f":"IF(W53=\"\",0,IF(OR($B53=\"ピアザH(準)\",$B53=\"大会議室(準)\"),7,IF(PG!$J$2<18,3,$B55)))","v":0},{"$f":"IF(AND($P$2=1,U53<>\"\"),利用申込書1!$Z$52,\"\")","v":""},{"$f":"IF(AND($P$2=1,U53<>\"\"),利用申込書1!$AD$52,\"\")","v":""},{"$f":"IF(AND($P$2=1,U53=\"\",V53<>\"\"),利用申込書1!$Z$52,\"\")","v":""},{"$f":"IF(AND($P$2=1, U53=\"\",V53<>\"\"),利用申込書1!$AD$52,\"\")","v":""},{"$f":"IF(AND($P$2=1,U53=\"\",V53=\"\",W53<>\"\"),利用申込書1!$Z$52,\"\")","v":""},{"$f":"IF(AND($P$2=1, U53=\"\",V53=\"\",W53<>\"\"),利用申込書1!$AD$52,\"\")","v":""},"0号室"]
[null,null,{"$f":"IF(R54=R50,\"\",$C$3)","v":""},{"$f":"PG!$Q$75","v":"18:00-21:00"},null,null,{"$f":"IF(利用申込書2!$A$28=\"\",$R$50,利用申込書2!$A$28)","v":"1月0日"},{"$f":"H53","v":0},null,null,null,null,null,null,null,null,{"$f":"Q53+0.3","v":0.3},{"$f":"R53","v":"1月0日"},{"$f":"S53","v":0},null,null,null,null,null,null,null,{"$f":"IF(AND($P$2=2,U53<>\"\"),利用申込書1!$Z$52,\"\")","v":""},{"$f":"IF(AND($P$2=2,U53<>\"\"),利用申込書1!$AD$52,\"\")","v":""},{"$f":"IF(AND($P$2=2,U53=\"\",V53<>\"\"),利用申込書1!$Z$52,\"\")","v":""},{"$f":"IF(AND($P$2=2,U53=\"\",V53<>\"\"),利用申込書1!$AD$52,\"\")","v":""},{"$f":"IF(AND($P$2=2,U53=\"\",V53=\"\",W53<>\"\"),利用申込書1!$Z$52,\"\")","v":""},{"$f":"IF(AND($P$2=2, U53=\"\",V53=\"\",W53<>\"\"),利用申込書1!$AD$52,\"\")","v":""},"0号室"]
[null,{"$f":"IF(T53=0,\"\",IF(VLOOKUP(T53,DATA!$B$28:$P$49,15,FALSE)>利用申込書1!$Y$23,利用申込書1!$Y$23,VLOOKUP(T53,DATA!$B$28:$P$49,15,FALSE)))","v":""},{"$f":"PG!$H$1","v":"：～："},{"$f":"CHOOSE(PG!H67,VLOOKUP(S53,DATA!$A$129:$N$151,3,FALSE),VLOOKUP(S53,DATA!$A$129:$N$151,4,FALSE),VLOOKUP(S53,DATA!$A$129:$N$151,5,FALSE),VLOOKUP(S53,DATA!$A$129:$N$151,6,FALSE),VLOOKUP(S53,DATA!$A$129:$N$151,7,FALSE),VLOOKUP(S53,DATA!$A$129:$N$151,8,FALSE),VLOOKUP(S53,DATA!$A$129:$N$151,9,FALSE),VLOOKUP(S53,DATA!$A$129:$N$151,10,FALSE),VLOOKUP(S53,DATA!$A$129:$N$151,11,FALSE),VLOOKUP(S53,DATA!$A$129:$N$151,12,FALSE),VLOOKUP(S53,DATA!$A$129:$N$151,13,FALSE),VLOOKUP(S53,DATA!$A$129:$N$151,14,FALSE),\"\")","v":{"$error":"#N/A"}},null,null,{"$f":"IF(利用申込書2!$A$28=\"\",$R$50,利用申込書2!$A$28)","v":"1月0日"},{"$f":"H53","v":0},null,null,null,null,null,null,null,null,null,{"$f":"R53","v":"1月0日"},{"$f":"S53","v":0},null,null,null,null,null,null,null,null,null,null,null,null,null,"0号室"]
[null,{"$f":"IF(T56=0,\"\",VLOOKUP(T56,DATA!$B$28:$O$49,14,FALSE))","v":""},{"$f":"IF(OR(B56=\"ピアザH(準)\",B56=\"大会議室(準)\"),\"準備(掲示なし)\",IF(AND(R53=R56, B53<>\"ピアザH(準)\"),\"同上\",利用申込書1!$F$21))","v":"同上"},{"$f":"PG!$O$79","v":"夜間"},null,null,{"$f":"IF(利用申込書2!$A$30=\"\",$R$53,利用申込書2!$A$30)","v":"1月0日"},{"$f":"VLOOKUP(T56,DATA!$B$2:$O$25,14,FALSE)","v":0},null,{"$f":"利用申込書2!AG30","v":""},{"$f":"VLOOKUP($S56,$B$130:$D$151,3,FALSE)","v":{"$error":"#N/A"}},null,null,null,null,null,{"$f":"IF(S56=102,101,IF(S56=209,208,S56))","v":0},{"$f":"PG!V80","v":"1月0日"},{"$f":"VLOOKUP(T56,DATA!$B$2:$O$25,14,FALSE)","v":0},{"$f":"PG!D79","v":0},{"$f":"IF(利用申込書2!M30=\"\",利用申込書2!R30,利用申込書2!R30+利用申込書2!M30)","v":""},{"$f":"利用申込書2!W30","v":""},{"$f":"利用申込書2!AB30","v":""},{"$f":"IF(U56=\"\",0,IF(OR($B56=\"ピアザH(準)\",$B56=\"大会議室(準)\"),7,IF(OR(PG!$I$2<12,PG!$I$2=12),B58,3)))","v":0},{"$f":"IF(V56=\"\",0,IF(OR($B56=\"ピアザH(準)\",$B56=\"大会議室(準)\"),7,IF(OR(PG!$J$2<13,PG!$J$2=13),3,$B58)))","v":0},{"$f":"IF(W56=\"\",0,IF(OR($B56=\"ピアザH(準)\",$B56=\"大会議室(準)\"),7,IF(PG!$J$2<18,3,$B58)))","v":0},{"$f":"IF(AND($P$2=1,U56<>\"\"),利用申込書1!$Z$52,\"\")","v":""},{"$f":"IF(AND($P$2=1,U56<>\"\"),利用申込書1!$AD$52,\"\")","v":""},{"$f":"IF(AND($P$2=1,U56=\"\",V56<>\"\"),利用申込書1!$Z$52,\"\")","v":""},{"$f":"IF(AND($P$2=1, U56=\"\",V56<>\"\"),利用申込書1!$AD$52,\"\")","v":""},{"$f":"IF(AND($P$2=1,U56=\"\",V56=\"\",W56<>\"\"),利用申込書1!$Z$52,\"\")","v":""},{"$f":"IF(AND($P$2=1, U56=\"\",V56=\"\",W56<>\"\"),利用申込書1!$AD$52,\"\")","v":""},"0号室"]
[null,null,{"$f":"IF(R57=R53,\"\",$C$3)","v":""},{"$f":"PG!$Q$79","v":"18:00-21:00"},null,null,{"$f":"IF(利用申込書2!$A$30=\"\",$R$53,利用申込書2!$A$30)","v":"1月0日"},{"$f":"H56","v":0},null,null,null,null,null,null,null,null,{"$f":"Q56+0.3","v":0.3},{"$f":"R56","v":"1月0日"},{"$f":"S56","v":0},null,null,null,null,null,null,null,{"$f":"IF(AND($P$2=2,U56<>\"\"),利用申込書1!$Z$52,\"\")","v":""},{"$f":"IF(AND($P$2=2,U56<>\"\"),利用申込書1!$AD$52,\"\")","v":""},{"$f":"IF(AND($P$2=2,U56=\"\",V56<>\"\"),利用申込書1!$Z$52,\"\")","v":""},{"$f":"IF(AND($P$2=2,U56=\"\",V56<>\"\"),利用申込書1!$AD$52,\"\")","v":""},{"$f":"IF(AND($P$2=2,U56=\"\",V56=\"\",W56<>\"\"),利用申込書1!$Z$52,\"\")","v":""},{"$f":"IF(AND($P$2=2, U56=\"\",V56=\"\",W56<>\"\"),利用申込書1!$AD$52,\"\")","v":""},"0号室"]
[null,{"$f":"IF(T56=0,\"\",IF(VLOOKUP(T56,DATA!$B$28:$P$49,15,FALSE)>利用申込書1!$Y$23,利用申込書1!$Y$23,VLOOKUP(T56,DATA!$B$28:$P$49,15,FALSE)))","v":""},{"$f":"PG!$H$1","v":"：～："},{"$f":"CHOOSE(PG!H70,VLOOKUP(S56,DATA!$A$129:$N$151,3,FALSE),VLOOKUP(S56,DATA!$A$129:$N$151,4,FALSE),VLOOKUP(S56,DATA!$A$129:$N$151,5,FALSE),VLOOKUP(S56,DATA!$A$129:$N$151,6,FALSE),VLOOKUP(S56,DATA!$A$129:$N$151,7,FALSE),VLOOKUP(S56,DATA!$A$129:$N$151,8,FALSE),VLOOKUP(S56,DATA!$A$129:$N$151,9,FALSE),VLOOKUP(S56,DATA!$A$129:$N$151,10,FALSE),VLOOKUP(S56,DATA!$A$129:$N$151,11,FALSE),VLOOKUP(S56,DATA!$A$129:$N$151,12,FALSE),VLOOKUP(S56,DATA!$A$129:$N$151,13,FALSE),VLOOKUP(S56,DATA!$A$129:$N$151,14,FALSE),\"\")","v":{"$error":"#VALUE!"}},null,null,{"$f":"IF(利用申込書2!$A$30=\"\",$R$53,利用申込書2!$A$30)","v":"1月0日"},{"$f":"H56","v":0},null,null,null,null,null,null,null,null,null,{"$f":"R56","v":"1月0日"},{"$f":"S56","v":0},null,null,null,null,null,null,null,null,null,null,null,null,null,"0号室"]
[null,{"$f":"IF(T59=0,\"\",VLOOKUP(T59,DATA!$B$28:$O$49,14,FALSE))","v":""},{"$f":"IF(OR(B59=\"ピアザH(準)\",B59=\"大会議室(準)\"),\"準備(掲示なし)\",IF(AND(R56=R59, B56<>\"ピアザH(準)\"),\"同上\",利用申込書1!$F$21))","v":"同上"},{"$f":"PG!$O$83","v":"夜間"},null,null,{"$f":"IF(利用申込書2!$A$32=\"\",$R$56,利用申込書2!$A$32)","v":"1月0日"},{"$f":"VLOOKUP(T59,DATA!$B$2:$O$25,14,FALSE)","v":0},null,{"$f":"利用申込書2!AG32","v":""},{"$f":"VLOOKUP($S59,$B$130:$D$151,3,FALSE)","v":{"$error":"#N/A"}},null,null,null,null,null,{"$f":"IF(S59=102,101,IF(S59=209,208,S59))","v":0},{"$f":"PG!V84","v":"1月0日"},{"$f":"VLOOKUP(T59,DATA!$B$2:$O$25,14,FALSE)","v":0},{"$f":"PG!D83","v":0},{"$f":"IF(利用申込書2!M32=\"\",利用申込書2!R32,利用申込書2!R32+利用申込書2!M32)","v":""},{"$f":"利用申込書2!W32","v":""},{"$f":"利用申込書2!AB32","v":""},{"$f":"IF(U59=\"\",0,IF(OR($B59=\"ピアザH(準)\",$B59=\"大会議室(準)\"),7,IF(OR(PG!$I$2<12,PG!$I$2=12),B61,3)))","v":0},{"$f":"IF(V59=\"\",0,IF(OR($B59=\"ピアザH(準)\",$B59=\"大会議室(準)\"),7,IF(OR(PG!$J$2<13,PG!$J$2=13),3,$B61)))","v":0},{"$f":"IF(W59=\"\",0,IF(OR($B59=\"ピアザH(準)\",$B59=\"大会議室(準)\"),7,IF(PG!$J$2<18,3,$B61)))","v":0},{"$f":"IF(AND($P$2=1,U59<>\"\"),利用申込書1!$Z$52,\"\")","v":""},{"$f":"IF(AND($P$2=1,U59<>\"\"),利用申込書1!$AD$52,\"\")","v":""},{"$f":"IF(AND($P$2=1,U59=\"\",V59<>\"\"),利用申込書1!$Z$52,\"\")","v":""},{"$f":"IF(AND($P$2=1, U59=\"\",V59<>\"\"),利用申込書1!$AD$52,\"\")","v":""},{"$f":"IF(AND($P$2=1,U59=\"\",V59=\"\",W59<>\"\"),利用申込書1!$Z$52,\"\")","v":""},{"$f":"IF(AND($P$2=1, U59=\"\",V59=\"\",W59<>\"\"),利用申込書1!$AD$52,\"\")","v":""},"0号室"]
[null,null,{"$f":"IF(R60=R56,\"\",$C$3)","v":""},{"$f":"PG!$Q$83","v":"18:00-21:00"},null,null,{"$f":"IF(利用申込書2!$A$32=\"\",$R$56,利用申込書2!$A$32)","v":"1月0日"},{"$f":"H59","v":0},null,null,null,null,null,null,null,null,{"$f":"Q59+0.3","v":0.3},{"$f":"R59","v":"1月0日"},{"$f":"S59","v":0},null,null,null,null,null,null,null,{"$f":"IF(AND($P$2=2,U59<>\"\"),利用申込書1!$Z$52,\"\")","v":""},{"$f":"IF(AND($P$2=2,U59<>\"\"),利用申込書1!$AD$52,\"\")","v":""},{"$f":"IF(AND($P$2=2,U59=\"\",V59<>\"\"),利用申込書1!$Z$52,\"\")","v":""},{"$f":"IF(AND($P$2=2,U59=\"\",V59<>\"\"),利用申込書1!$AD$52,\"\")","v":""},{"$f":"IF(AND($P$2=2,U59=\"\",V59=\"\",W59<>\"\"),利用申込書1!$Z$52,\"\")","v":""},{"$f":"IF(AND($P$2=2, U59=\"\",V59=\"\",W59<>\"\"),利用申込書1!$AD$52,\"\")","v":""},"0号室"]
[null,{"$f":"IF(T59=0,\"\",IF(VLOOKUP(T59,DATA!$B$28:$P$49,15,FALSE)>利用申込書1!$Y$23,利用申込書1!$Y$23,VLOOKUP(T59,DATA!$B$28:$P$49,15,FALSE)))","v":""},{"$f":"PG!$H$1","v":"：～："},{"$f":"CHOOSE(PG!H73,VLOOKUP(S59,DATA!$A$129:$N$151,3,FALSE),VLOOKUP(S59,DATA!$A$129:$N$151,4,FALSE),VLOOKUP(S59,DATA!$A$129:$N$151,5,FALSE),VLOOKUP(S59,DATA!$A$129:$N$151,6,FALSE),VLOOKUP(S59,DATA!$A$129:$N$151,7,FALSE),VLOOKUP(S59,DATA!$A$129:$N$151,8,FALSE),VLOOKUP(S59,DATA!$A$129:$N$151,9,FALSE),VLOOKUP(S59,DATA!$A$129:$N$151,10,FALSE),VLOOKUP(S59,DATA!$A$129:$N$151,11,FALSE),VLOOKUP(S59,DATA!$A$129:$N$151,12,FALSE),VLOOKUP(S59,DATA!$A$129:$N$151,13,FALSE),VLOOKUP(S59,DATA!$A$129:$N$151,14,FALSE),\"\")","v":{"$error":"#VALUE!"}},null,null,{"$f":"IF(利用申込書2!$A$32=\"\",$R$56,利用申込書2!$A$32)","v":"1月0日"},{"$f":"H59","v":0},null,null,null,null,null,null,null,null,null,{"$f":"R59","v":"1月0日"},{"$f":"S59","v":0},null,null,null,null,null,null,null,null,null,null,null,null,null,"0号室"]
[null,{"$f":"VLOOKUP(T62,DATA!$B$28:$O$49,14,FALSE)","v":{"$error":"#N/A"}},{"$f":"IF(OR(B62=\"ピアザH(準)\",B62=\"大会議室(準)\"),\"準備(掲示なし)\",IF(AND(R59=R62, R59<>\"ピアザH(準)\"),\"同上\",利用申込書1!$F$21))","v":{"$error":"#N/A"}},null,null,null,null,null,null,null,{"$f":"VLOOKUP($S62,$B$130:$D$151,3,FALSE)","v":{"$error":"#N/A"}}]
[null,null,{"$f":"IF(R63=R59,\"\",$C$3)","v":",(0様)"}]
[null,{"$f":"IF(T62=0,\"\",IF(VLOOKUP(T62,DATA!$B$28:$P$49,15,FALSE)>利用申込書1!$Y$23,利用申込書1!$Y$23,VLOOKUP(T62,DATA!$B$28:$P$49,15,FALSE)))","v":""},{"$f":"PG!$H$1","v":"：～："}]
[null,{"$f":"VLOOKUP(T65,DATA!$B$28:$O$49,14,FALSE)","v":{"$error":"#N/A"}},{"$f":"IF(OR(B65=\"ピアザH(準)\",B65=\"大会議室(準)\"),\"準備(掲示なし)\",IF(AND(R62=R65, R62<>\"ピアザH(準)\"),\"同上\",利用申込書1!$F$21))","v":{"$error":"#N/A"}},null,null,null,null,null,null,null,{"$f":"VLOOKUP($S65,$B$130:$D$151,3,FALSE)","v":{"$error":"#N/A"}}]
[null,null,{"$f":"IF(R66=R62,\"\",$C$3)","v":""}]
[null,{"$f":"IF(T65=0,\"\",IF(VLOOKUP(T65,DATA!$B$28:$P$49,15,FALSE)>利用申込書1!$Y$23,利用申込書1!$Y$23,VLOOKUP(T65,DATA!$B$28:$P$49,15,FALSE)))","v":""},{"$f":"PG!$H$1","v":"：～："}]
[null,{"$f":"VLOOKUP(T68,DATA!$B$28:$O$49,14,FALSE)","v":{"$error":"#N/A"}},{"$f":"IF(OR(B68=\"ピアザH(準)\",B68=\"大会議室(準)\"),\"準備(掲示なし)\",IF(AND(R65=R68, R65<>\"ピアザH(準)\"),\"同上\",利用申込書1!$F$21))","v":{"$error":"#N/A"}},null,null,null,null,null,null,null,{"$f":"VLOOKUP($S68,$B$130:$D$151,3,FALSE)","v":{"$error":"#N/A"}}]
[null,null,{"$f":"IF(R69=R65,\"\",$C$3)","v":""}]
[null,{"$f":"IF(T68=0,\"\",IF(VLOOKUP(T68,DATA!$B$28:$P$49,15,FALSE)>利用申込書1!$Y$23,利用申込書1!$Y$23,VLOOKUP(T68,DATA!$B$28:$P$49,15,FALSE)))","v":""},{"$f":"PG!$H$1","v":"：～："}]
[null,{"$f":"VLOOKUP(T71,DATA!$B$28:$O$49,14,FALSE)","v":{"$error":"#N/A"}},{"$f":"IF(R71=R68,\"同上\",$C$2)","v":"同上"},null,null,null,null,null,null,null,{"$f":"VLOOKUP($S71,$B$130:$D$151,3,FALSE)","v":{"$error":"#N/A"}}]
[null,null,{"$f":"IF(R72=R68,\"\",$C$3)","v":""}]
[null,{"$f":"IF(T71=0,\"\",IF(VLOOKUP(T71,DATA!$B$28:$P$49,15,FALSE)>利用申込書1!$Y$23,利用申込書1!$Y$23,VLOOKUP(T71,DATA!$B$28:$P$49,15,FALSE)))","v":""},{"$f":"PG!$H$1","v":"：～："}]
[null,{"$f":"VLOOKUP(T74,DATA!$B$28:$O$49,14,FALSE)","v":{"$error":"#N/A"}},{"$f":"IF(R74=R71,\"同上\",$C$2)","v":"同上"},null,null,null,null,null,null,null,{"$f":"VLOOKUP($S74,$B$130:$D$151,3,FALSE)","v":{"$error":"#N/A"}}]
[null,null,{"$f":"IF(R75=R71,\"\",$C$3)","v":""}]
[null,{"$f":"IF(T74=0,\"\",IF(VLOOKUP(T74,DATA!$B$28:$P$49,15,FALSE)>利用申込書1!$Y$23,利用申込書1!$Y$23,VLOOKUP(T74,DATA!$B$28:$P$49,15,FALSE)))","v":""},{"$f":"PG!$H$1","v":"：～："}]
[null,{"$f":"VLOOKUP(T77,DATA!$B$28:$O$49,14,FALSE)","v":{"$error":"#N/A"}},{"$f":"IF(R77=R74,\"同上\",$C$2)","v":"同上"},null,null,null,null,null,null,null,{"$f":"VLOOKUP($S77,$B$130:$D$151,3,FALSE)","v":{"$error":"#N/A"}}]
[null,null,{"$f":"IF(R78=R74,\"\",$C$3)","v":""}]
[null,{"$f":"IF(OR(B77=\"ピアザH(準)\",B77=\"大会議室(準)\"),10,利用申込書1!$Y$23)","v":{"$error":"#N/A"}},{"$f":"PG!$H$1","v":"：～："}]
[null,{"$f":"VLOOKUP(T80,DATA!$B$28:$O$49,14,FALSE)","v":{"$error":"#N/A"}},{"$f":"IF(R80=R77,\"同上\",$C$2)","v":"同上"},null,null,null,null,null,null,null,{"$f":"VLOOKUP($S80,$B$130:$D$151,3,FALSE)","v":{"$error":"#N/A"}}]
[null,null,{"$f":"IF(R81=R77,\"\",$C$3)","v":""}]
[null,{"$f":"IF(T80=0,\"\",IF(VLOOKUP(T80,DATA!$B$28:$P$49,15,FALSE)>利用申込書1!$Y$23,利用申込書1!$Y$23,VLOOKUP(T80,DATA!$B$28:$P$49,15,FALSE)))","v":""},{"$f":"PG!$H$1","v":"：～："}]
[null,{"$f":"VLOOKUP(T83,DATA!$B$28:$O$49,14,FALSE)","v":{"$error":"#N/A"}},{"$f":"IF(R83=R80,\"同上\",$C$2)","v":"同上"},null,null,null,null,null,null,null,{"$f":"VLOOKUP($S83,$B$130:$D$151,3,FALSE)","v":{"$error":"#N/A"}}]
[null,null,{"$f":"IF(R84=R80,\"\",$C$3)","v":""}]
[null,{"$f":"IF(T83=0,\"\",IF(VLOOKUP(T83,DATA!$B$28:$P$49,15,FALSE)>利用申込書1!$Y$23,利用申込書1!$Y$23,VLOOKUP(T83,DATA!$B$28:$P$49,15,FALSE)))","v":""},{"$f":"PG!$H$1","v":"：～："}]
[null,{"$f":"VLOOKUP(T86,DATA!$B$28:$O$49,14,FALSE)","v":{"$error":"#N/A"}},{"$f":"IF(R86=R83,\"同上\",$C$2)","v":"同上"},null,null,null,null,null,null,null,{"$f":"VLOOKUP($S86,$B$130:$D$151,3,FALSE)","v":{"$error":"#N/A"}}]
[null,null,{"$f":"IF(R87=R83,\"\",$C$3)","v":""}]
[null,{"$f":"IF(T86=0,\"\",IF(VLOOKUP(T86,DATA!$B$28:$P$49,15,FALSE)>利用申込書1!$Y$23,利用申込書1!$Y$23,VLOOKUP(T86,DATA!$B$28:$P$49,15,FALSE)))","v":""},{"$f":"PG!$H$1","v":"：～："}]
[null,{"$f":"VLOOKUP(T89,DATA!$B$28:$O$49,14,FALSE)","v":{"$error":"#N/A"}},{"$f":"IF(R89=R86,\"同上\",$C$2)","v":"同上"},null,null,null,null,null,null,null,{"$f":"VLOOKUP($S89,$B$130:$D$151,3,FALSE)","v":{"$error":"#N/A"}}]
[null,null,{"$f":"IF(R90=R86,\"\",$C$3)","v":""}]
[null,{"$f":"IF(T89=0,\"\",IF(VLOOKUP(T89,DATA!$B$28:$P$49,15,FALSE)>利用申込書1!$Y$23,利用申込書1!$Y$23,VLOOKUP(T89,DATA!$B$28:$P$49,15,FALSE)))","v":""},{"$f":"PG!$H$1","v":"：～："}]
[null,{"$f":"VLOOKUP(T92,DATA!$B$28:$O$49,14,FALSE)","v":{"$error":"#N/A"}},{"$f":"IF(R92=R89,\"同上\",$C$2)","v":"同上"},null,null,null,null,null,null,null,{"$f":"VLOOKUP($S92,$B$130:$D$151,3,FALSE)","v":{"$error":"#N/A"}}]
[null,null,{"$f":"IF(R93=R89,\"\",$C$3)","v":""}]
[null,{"$f":"IF(T92=0,\"\",IF(VLOOKUP(T92,DATA!$B$28:$P$49,15,FALSE)>利用申込書1!$Y$23,利用申込書1!$Y$23,VLOOKUP(T92,DATA!$B$28:$P$49,15,FALSE)))","v":""},{"$f":"PG!$H$1","v":"：～："}]
[null,{"$f":"VLOOKUP(T95,DATA!$B$28:$O$49,14,FALSE)","v":{"$error":"#N/A"}},{"$f":"IF(R95=R92,\"同上\",$C$2)","v":"同上"},null,null,null,null,null,null,null,{"$f":"VLOOKUP($S95,$B$130:$D$151,3,FALSE)","v":{"$error":"#N/A"}}]
[null,null,{"$f":"IF(R96=R92,\"\",$C$3)","v":""}]
[null,{"$f":"IF(T95=0,\"\",IF(VLOOKUP(T95,DATA!$B$28:$P$49,15,FALSE)>利用申込書1!$Y$23,利用申込書1!$Y$23,VLOOKUP(T95,DATA!$B$28:$P$49,15,FALSE)))","v":""},{"$f":"PG!$H$1","v":"：～："}]
[null,{"$f":"VLOOKUP(T98,DATA!$B$28:$O$49,14,FALSE)","v":{"$error":"#N/A"}},{"$f":"IF(R98=R95,\"同上\",$C$2)","v":"同上"},null,null,null,null,null,null,null,{"$f":"VLOOKUP($S98,$B$130:$D$151,3,FALSE)","v":{"$error":"#N/A"}}]
[null,null,{"$f":"IF(R99=R95,\"\",$C$3)","v":""}]
[null,{"$f":"IF(T98=0,\"\",IF(VLOOKUP(T98,DATA!$B$28:$P$49,15,FALSE)>利用申込書1!$Y$23,利用申込書1!$Y$23,VLOOKUP(T98,DATA!$B$28:$P$49,15,FALSE)))","v":""},{"$f":"PG!$H$1","v":"：～："}]
[null,{"$f":"VLOOKUP(T101,DATA!$B$28:$O$49,14,FALSE)","v":{"$error":"#N/A"}},{"$f":"IF(R101=R98,\"同上\",$C$2)","v":"同上"},null,null,null,null,null,null,null,{"$f":"VLOOKUP($S101,$B$130:$D$151,3,FALSE)","v":{"$error":"#N/A"}}]
[null,null,{"$f":"IF(R102=R98,\"\",$C$3)","v":""}]
[null,{"$f":"IF(T101=0,\"\",IF(VLOOKUP(T101,DATA!$B$28:$P$49,15,FALSE)>利用申込書1!$Y$23,利用申込書1!$Y$23,VLOOKUP(T101,DATA!$B$28:$P$49,15,FALSE)))","v":""},{"$f":"PG!$H$1","v":"：～："}]
[null,{"$f":"VLOOKUP(T104,DATA!$B$28:$O$49,14,FALSE)","v":{"$error":"#N/A"}},{"$f":"IF(R104=R101,\"同上\",$C$2)","v":"同上"},null,null,null,null,null,null,null,{"$f":"VLOOKUP($S104,$B$130:$D$151,3,FALSE)","v":{"$error":"#N/A"}}]
[null,null,{"$f":"IF(R105=R101,\"\",$C$3)","v":""}]
[null,{"$f":"IF(T104=0,\"\",IF(VLOOKUP(T104,DATA!$B$28:$P$49,15,FALSE)>利用申込書1!$Y$23,利用申込書1!$Y$23,VLOOKUP(T104,DATA!$B$28:$P$49,15,FALSE)))","v":""},{"$f":"PG!$H$1","v":"：～："}]
[null,{"$f":"VLOOKUP(T107,DATA!$B$28:$O$49,14,FALSE)","v":{"$error":"#N/A"}},{"$f":"IF(R107=R104,\"同上\",$C$2)","v":"同上"},null,null,null,null,null,null,null,{"$f":"VLOOKUP($S107,$B$130:$D$151,3,FALSE)","v":{"$error":"#N/A"}}]
[null,null,{"$f":"IF(R108=R104,\"\",$C$3)","v":""}]
[null,{"$f":"IF(T107=0,\"\",IF(VLOOKUP(T107,DATA!$B$28:$P$49,15,FALSE)>利用申込書1!$Y$23,利用申込書1!$Y$23,VLOOKUP(T107,DATA!$B$28:$P$49,15,FALSE)))","v":""},{"$f":"PG!$H$1","v":"：～："}]
[null,{"$f":"VLOOKUP(T110,DATA!$B$28:$O$49,14,FALSE)","v":{"$error":"#N/A"}},{"$f":"IF(R110=R107,\"同上\",$C$2)","v":"同上"},null,null,null,null,null,null,null,{"$f":"VLOOKUP($S110,$B$130:$D$151,3,FALSE)","v":{"$error":"#N/A"}}]
[null,null,{"$f":"IF(R111=R107,\"\",$C$3)","v":""}]
[null,{"$f":"IF(T110=0,\"\",IF(VLOOKUP(T110,DATA!$B$28:$P$49,15,FALSE)>利用申込書1!$Y$23,利用申込書1!$Y$23,VLOOKUP(T110,DATA!$B$28:$P$49,15,FALSE)))","v":""},{"$f":"PG!$H$1","v":"：～："}]
[null,{"$f":"VLOOKUP(T113,DATA!$B$28:$O$49,14,FALSE)","v":{"$error":"#N/A"}},{"$f":"IF(R113=R110,\"同上\",$C$2)","v":"同上"},null,null,null,null,null,null,null,{"$f":"VLOOKUP($S113,$B$130:$D$151,3,FALSE)","v":{"$error":"#N/A"}}]
[null,null,{"$f":"IF(R114=R110,\"\",$C$3)","v":""}]
[null,{"$f":"IF(T113=0,\"\",IF(VLOOKUP(T113,DATA!$B$28:$P$49,15,FALSE)>利用申込書1!$Y$23,利用申込書1!$Y$23,VLOOKUP(T113,DATA!$B$28:$P$49,15,FALSE)))","v":""},{"$f":"PG!$H$1","v":"：～："}]
[null,{"$f":"VLOOKUP(T116,DATA!$B$28:$O$49,14,FALSE)","v":{"$error":"#N/A"}},{"$f":"IF(R116=R113,\"同上\",$C$2)","v":"同上"},null,null,null,null,null,null,null,{"$f":"VLOOKUP($S116,$B$130:$D$151,3,FALSE)","v":{"$error":"#N/A"}}]
[null,null,{"$f":"IF(R117=R113,\"\",$C$3)","v":""}]
[null,{"$f":"IF(T116=0,\"\",IF(VLOOKUP(T116,DATA!$B$28:$P$49,15,FALSE)>利用申込書1!$Y$23,利用申込書1!$Y$23,VLOOKUP(T116,DATA!$B$28:$P$49,15,FALSE)))","v":""},{"$f":"PG!$H$1","v":"：～："}]
[null,{"$f":"VLOOKUP(T119,DATA!$B$28:$O$49,14,FALSE)","v":{"$error":"#N/A"}},{"$f":"IF(R119=R116,\"同上\",$C$2)","v":"同上"},null,null,null,null,null,null,null,{"$f":"VLOOKUP($S119,$B$130:$D$151,3,FALSE)","v":{"$error":"#N/A"}}]
[null,null,{"$f":"IF(R120=R116,\"\",$C$3)","v":""}]
[null,{"$f":"IF(T119=0,\"\",IF(VLOOKUP(T119,DATA!$B$28:$P$49,15,FALSE)>利用申込書1!$Y$23,利用申込書1!$Y$23,VLOOKUP(T119,DATA!$B$28:$P$49,15,FALSE)))","v":""},{"$f":"PG!$H$1","v":"：～："}]
[]
[]
[]
[]
[]
[]
[]
[]
[null,101,"ピアザホール"]
[null,102,"ピアザホール準備"]
[null,201,"201号室"]
[null,202,"202号室"]
[null,203,"203号室"]
[null,204,"204号室"]
[null,205,"205号室"]
[null,206,"206号室"]
[null,207,"207号室"]
[null,208,"大会議室"]
[null,209,"大会議室準備"]
[null,301,"301号室"]
[null,302,"302号室"]
[null,303,"303号室"]
[null,304,"304号室"]
[null,305,"305号室"]
[null,306,"特別会議室"]
[null,307,"応接室"]
[null,308,"和室"]
[null,309,"茶室"]
[null,310,"練習室"]
[null,311,"練習室学生"]
[null,null,null,{"$f":"SUM(D130:D151)","v":0}]

{"sheet":"Sheet4","index":8,"n_rows":0,"n_cols":0,"rows_kept":0,"cut":false,"hidden":true,"merged":[]}

{"sheet":"UD","index":9,"n_rows":2,"n_cols":20,"rows_kept":2,"cut":false,"hidden":true,"merged":[]}
["No.","申請日","利用日","団体名","区分","責任者氏名","メールアドレス","電話番号","郵便番号","住所","所在地","施設利用料","付帯設備利用料","料飲代","駐車場利用料","計","振込支払予定日","支払日","支払方法",{"$f":"PG!K1","v":false}]
[null,{"$f":"利用申込書1!AD3&\"年\"&利用申込書1!AH3&\"月\"&利用申込書1!AM3&\"日\"","v":"年月日"},null,{"$f":"利用申込書1!K9","v":"00:00:00"},{"$f":"利用申込書1!AD52","v":"nf"},{"$f":"利用申込書1!AD12","v":0},{"$f":"利用申込書1!K15","v":0},{"$f":"利用申込書1!AD15&\"-\"&利用申込書1!AH15&\"-\"&利用申込書1!AM15","v":"--"},{"$f":"利用申込書1!L13&\"-\"&利用申込書1!O13","v":"-"},{"$f":"利用申込書1!K14","v":0},{"$f":"利用申込書1!Z52","v":""},null,null,null,null,{"$f":"SUM(L2:O2)","v":0},{"$f":"請求書ひな形!I44","v":{"$error":"#NUM!"}},null,{"$f":"IF(AND(T1=TRUE,T2=TRUE),\"現金(付帯)・銀行振込(施設)\",IF(AND(T1=TRUE,T2=FALSE),\"銀行振込\",\"現金\"))","v":"現金"},false]

{"sheet":"PG","index":10,"n_rows":238,"n_cols":32,"rows_kept":238,"cut":false,"hidden":true,"merged":[[4,8,4,12]]}
[null,"県内・外",{"$f":"IF(OR(AND(利用申込書1!L13>0,利用申込書1!L13<520),利用申込書1!L13>529, AND(利用申込書1!L13=520,利用申込書1!O13>=\"0461\",利用申込書1!O13<=\"0465\")),2,1)","v":1},{"$f":"IF(OR(利用申込書1!L13=\"\", AND(利用申込書1!L13>=520,利用申込書1!L13<=529), 利用申込書1!L13=520,AND(利用申込書1!O13<\"0461\",利用申込書1!L13=520,利用申込書1!O13>\"0465\")),1,2)","v":1},null,{"$f":"IF(OR($C$1=1,利用申込書1!L13=\"\"),\"\",\"<県外料金適用>\")","v":""},null,{"$f":"利用申込書1!$I$23&利用申込書1!$K$23&利用申込書1!$L$23&利用申込書1!$M$23&利用申込書1!N23&利用申込書1!$O$23&利用申込書1!$Q$23&利用申込書1!$R$23","v":"：～："},{"$f":"LEFT(H1,2)","v":"：～"},{"$f":"IF(MID(H1,6,1)=\"～\",MID(H1,7,2),MID(H1,6,2))","v":""},false,null,null,null,null,null,null,null,null,null,null,null,null,null,null,null,null,null,null,null,{"$f":"IF(利用申込書1!K9=\"\",利用申込書1!AD12&\"様\",利用申込書1!K9)","v":"様"}]
[null,"有料加算",1,{"$f":"IF(OR(AND(利用申込書1!L13>0,利用申込書1!L13<520),利用申込書1!L13>529, AND(利用申込書1!L13=520,利用申込書1!O13>=\"0461\",利用申込書1!O13<=\"0465\")),2,1)","v":1},null,{"$f":"IF($C$1=1,\"県内料金\",\"県外料金（5割加算)\")","v":"県内料金"},{"$f":"IF($C$2=1,\"なし\",(IF($C$2=2,\"参加費3割加算\",\"参加費5割加算\")))","v":"なし"},null,{"$f":"VALUE(I1)","v":{"$error":"#VALUE!"}},{"$f":"VALUE(J1)","v":{"$error":"#VALUE!"}},false,null,null,null,null,null,null,null,null,null,null,null,null,null,null,null,null,null,null,null,{"$f":"利用申込書1!AD12","v":0}]
[null,null,null,null,null,{"$f":"IF(OR(利用申込書1!L13<520,利用申込書1!L13>529, AND(利用申込書1!L13=520,利用申込書1!O13>=\"0461\",利用申込書1!O13<=\"0465\")),2,1)","v":2},{"$f":"IF(OR(利用申込書1!L13<=521,利用申込書1!L13>=529), 2,1)","v":2},null,null,null,null,null,null,null,null,null,null,null,null,null,null,null,null,null,null,null,null,null,null,null,{"$f":"AF3&利用申込書1!AD15&利用申込書1!AH15&利用申込書1!AM15","v":"Tel"},"Tel"]
[null,null,null,null,null,null,null,null,null,null,null,null,null,null,null,null,null,null,null,null,null,null,null,null,null,null,{"$f":"Z5&Y4&AD4","v":""},null,null,null,{"$f":"AF5&利用申込書1!AD16&利用申込書1!AH16&利用申込書1!AM16","v":"M"},"Fax"]
[null,"利用申し込み書用",null,null,null,null,null,null,"料金",null,null,null,null,null,null,null,null,null,null,null,null,null,null,null,null,null,null,null,null,null,{"$f":"PG!AF5&利用申込書1!K15","v":"M"},"M"]
[null,"日時","土日祝判定(1：平日)","会議室","チェックボックス",null,null,"No.(組み合わせ)","8時","A","P","N","P=N","SUM",null,null,null,null,null,null,null,null,null,null,null,null,null,null,null,null,{"$f":"利用申込書1!AT4","v":".."}]
[{"$f":"IF(D7=\"大会議室(準備)\",\"大会議室\",(IF(D7=\"大会議室(本番)\",\"大会議室\",(IF(D7=\"ピアザホール(準備)\",\"PH\",IF(D7=\"ピアザホール(本番)\",\"PH\",IF(D7=\"練習室(一般)\",\"練習室\",IF(D7=\"練習室(学生)\",\"練習室\",D7))))))))","v":0},{"$f":"IF(利用申込書1!A27=\"\", B3,利用申込書1!A27)","v":"00:00:00"},{"$f":"IF(OR((WEEKDAY(B7,2)>=6),COUNTIF(DATA!Q3:T23,B7)),2,1)","v":2},{"$f":"利用申込書1!F27","v":0},"チェック1",{"$f":"IF(G7,1,2)","v":2},false,{"$f":"IF(AND($C$1=1,$C$2=1,C7=1),1,(IF(AND($C$1=1,$C$2=2,C7=1),2,(IF(AND($C$1=1,$C$2=3,C7=1),3,(IF(AND($C$1=2,$C$2=1,C7=1),4,(IF(AND($C$1=2,$C$2=2,C7=1),5,(IF(AND($C$1=2,$C$2=3,C7=1),6,(IF(AND($C$1=1,$C$2=1,C7=2),7,(IF(AND($C$1=1,$C$2=2,C7=2),8,(IF(AND($C$1=1,$C$2=3,C7=2),9,(IF(AND($C$1=2,$C$2=1,C7=2),10,(IF(AND($C$1=2,$C$2=2,C7=2),11,(IF(AND($C$1=2,$C$2=3,C7=2),12,\"\")))))))))))))))))))))))","v":7},{"$f":"CHOOSE(H7,VLOOKUP(D7,DATA!$B$2:$N$25,2,FALSE),VLOOKUP(D7,DATA!$B$2:$N$25,3,FALSE),VLOOKUP(D7,DATA!$B$2:$N$25,4,FALSE),VLOOKUP(D7,DATA!$B$2:$N$25,5,FALSE),VLOOKUP(D7,DATA!$B$2:$N$25,6,FALSE),VLOOKUP(D7,DATA!$B$2:$N$25,7,FALSE),VLOOKUP(D7,DATA!$B$2:$N$25,8,FALSE),VLOOKUP(D7,DATA!$B$2:$N$25,9,FALSE),VLOOKUP(D7,DATA!$B$2:$N$25,10,FALSE),VLOOKUP(D7,DATA!$B$2:$N$25,11,FALSE),VLOOKUP(D7,DATA!$B$2:$N$25,12,FALSE),VLOOKUP(D7,DATA!$B$2:$N$25,13,FALSE),\"\")*(IF(F7=1,1,0))","v":0},{"$f":"CHOOSE(H7,VLOOKUP(D7,DATA!$B$27:$N$50,2,FALSE),VLOOKUP(D7,DATA!$B$27:$N$50,3,FALSE),VLOOKUP(D7,DATA!$B$27:$N$50,4,FALSE),VLOOKUP(D7,DATA!$B$27:$N$50,5,FALSE),VLOOKUP(D7,DATA!$B$27:$N$50,6,FALSE),VLOOKUP(D7,DATA!$B$27:$N$50,7,FALSE),VLOOKUP(D7,DATA!$B$27:$N$50,8,FALSE),VLOOKUP(D7,DATA!$B$27:$N$50,9,FALSE),VLOOKUP(D7,DATA!$B$27:$N$50,10,FALSE),VLOOKUP(D7,DATA!$B$27:$N$50,11,FALSE),VLOOKUP(D7,DATA!$B$27:$N$50,12,FALSE),VLOOKUP(D7,DATA!$B$27:$N$50,13,FALSE),\"\")*(IF(F8=1,1,0))","v":0},{"$f":"CHOOSE(H7,VLOOKUP(D7,DATA!$B$52:$N$75,2,FALSE),VLOOKUP(D7,DATA!$B$52:$N$75,3,FALSE),VLOOKUP(D7,DATA!$B$52:$N$75,4,FALSE),VLOOKUP(D7,DATA!$B$52:$N$77,5,FALSE),VLOOKUP(D7,DATA!$B$52:$N$75,6,FALSE),VLOOKUP(D7,DATA!$B$52:$N$75,7,FALSE),VLOOKUP(D7,DATA!$B$52:$N$75,8,FALSE),VLOOKUP(D7,DATA!$B$52:$N$75,9,FALSE),VLOOKUP(D7,DATA!$B$52:$N$75,10,FALSE),VLOOKUP(D7,DATA!$B$52:$N$75,11,FALSE),VLOOKUP(D7,DATA!$B$52:$N$75,12,FALSE),VLOOKUP(D7,DATA!$B$52:$N$75,13,FALSE),\"\")*(IF(F9=1,1,0))","v":0},{"$f":"CHOOSE(H7,VLOOKUP(D7,DATA!$B$77:$N$100,2,FALSE),VLOOKUP(D7,DATA!$B$77:$N$100,3,FALSE),VLOOKUP(D7,DATA!$B$77:$N$100,4,FALSE),VLOOKUP(D7,DATA!$B$77:$N$100,5,FALSE),VLOOKUP(D7,DATA!$B$77:$N$100,6,FALSE),VLOOKUP(D7,DATA!$B$77:$N$100,7,FALSE),VLOOKUP(D7,DATA!$B$77:$N$100,8,FALSE),VLOOKUP(D7,DATA!$B$77:$N$100,9,FALSE),VLOOKUP(D7,DATA!$B$77:$N$100,10,FALSE),VLOOKUP(D7,DATA!$B$77:$N$100,11,FALSE),VLOOKUP(D7,DATA!$B$77:$N$100,12,FALSE),VLOOKUP(D7,DATA!$B$77:$N$100,13,FALSE),\"\")*(IF(F10=1,1,0))","v":0},{"$f":"CHOOSE(H7,VLOOKUP(D7,DATA!$B$102:$N$125,2,FALSE),VLOOKUP(D7,DATA!$B$102:$N$125,3,FALSE),VLOOKUP(D7,DATA!$B$102:$N$125,4,FALSE),VLOOKUP(D7,DATA!$B$102:$N$125,5,FALSE),VLOOKUP(D7,DATA!$B$102:$N$125,6,FALSE),VLOOKUP(D7,DATA!$B$102:$N$125,7,FALSE),VLOOKUP(D7,DATA!$B$102:$N$125,8,FALSE),VLOOKUP(D7,DATA!$B$102:$N$125,9,FALSE),VLOOKUP(D7,DATA!$B$102:$N$125,10,FALSE),VLOOKUP(D7,DATA!$B$102:$N$125,11,FALSE),VLOOKUP(D7,DATA!$B$102:$N$125,12,FALSE),VLOOKUP(D7,DATA!$B$102:$N$125,13,FALSE),\"\")*(IF(F10=1,1,0))","v":0},{"$f":"利用申込書1!AG27","v":""},{"$f":"IF(AND(F8=1,F9=1,F10=1),\"午前-午後-夜間\",(IF(AND(F8=1,F9=1,F10=2),\"午前-午後\",(IF(AND(F8=2,F9=1,F10=1),\"午後-夜間\",(IF(AND(F8=1,F9=2,F10=2),\"午前\",(IF(AND(F8=2,F9=1,F10=2),\"午後\",IF(AND(F8=1,F9=2,F10=1),\"午前・夜間\",\"夜間\"))))))))))","v":"夜間"},null,{"$f":"IF(I7>0,VLOOKUP(O7,$A$235:$B$238,2,FALSE),VLOOKUP(O7,$A$226:$B$232,2,FALSE))","v":"18:00-21:00"},{"$f":"B7","v":"00:00:00"},{"$f":"B7","v":"00:00:00"},{"$f":"YEAR(S7)","v":1900},"年",{"$f":"T7&U7&T8&U8","v":"1900年1月"},{"$f":"IF(AND(F8=1,F9=1,F10=1),\"APN\",(IF(AND(F8=1,F9=1,F10=2),\"AP\",(IF(AND(F8=2,F9=1,F10=1),\"PN\",(IF(AND(F8=1,F9=2,F10=2),\"A\",(IF(AND(F8=2,F9=1,F10=2),\"P\",\"N\")))))))))","v":"N"},{"$f":"利用申込書1!$AV$50","v":""},{"$f":"X8&W7&\"・\"&AB7","v":"0N・"},{"$f":"T7&U7","v":"1900年"},{"$f":"Z7&V8","v":"1900年1月0日"},{"$f":"CLEAN(X7)","v":""},null,null,{"$f":"利用申込書1!AT5","v":"2024-04-07"}]
[null,{"$f":"TEXT(B7,\"YYYY\")","v":"1900"},null,null,"チェック2",{"$f":"IF(F7=1,1,IF(G8,1,2))","v":2},false,null,null,{"$f":"B10&$J$6","v":"0A"},{"$f":"B10&$K$6","v":"0P"},{"$f":"B10&$L$6","v":"0N"},null,null,null,null,{"$f":"LEFT(Q7,2)","v":"18"},null,{"$f":"B7","v":"00:00:00"},{"$f":"MONTH(S7)","v":1},"月",{"$f":"T8&U8&T9&U9","v":"1月0日"},{"$f":"D7","v":0},{"$f":"LEFT(W8,3)","v":"0"}]
[null,{"$f":"TEXT(B7,\"YYYYmm\")","v":"190001"},null,null,"チェック3",2,false,null,null,{"$f":"G8","v":false},{"$f":"G9","v":false},{"$f":"G10","v":false},null,null,null,null,{"$f":"IF(MID(Q7,6,1)=\"-\",MID(Q7,7,2),MID(Q7,6,2))","v":"21"},null,null,{"$f":"DAY(S7)","v":0},"日",{"$f":"T9&U9","v":"0日"},null,null,null,null,null,null,null,null,{"$f":"利用申込書1!AB44","v":""}]
[null,{"$f":"TEXT(B7,\"d\")","v":"0"},null,null,"チェック4",2,false,null,null,null,null,null,null,null,null,null,null,null,null,null,null,{"$f":"T8&U8","v":"1月"}]
[{"$f":"IF(D11=\"大会議室(準備)\",\"大会議室\",(IF(D11=\"大会議室(本番)\",\"大会議室\",(IF(D11=\"ピアザホール(準備)\",\"PH\",IF(D11=\"ピアザホール(本番)\",\"PH\",IF(D11=\"練習室(一般)\",\"練習室\",IF(D11=\"練習室(学生)\",\"練習室\",D11))))))))","v":0},{"$f":"IF(利用申込書1!A29=\"\", B7,利用申込書1!A29)","v":"00:00:00"},{"$f":"IF(OR((WEEKDAY(B11,2)>=6),COUNTIF(DATA!$Q$3:$T$23,B11)),2,1)","v":2},{"$f":"利用申込書1!F29","v":0},"チェック1",2,false,{"$f":"IF(AND($C$1=1,$C$2=1,C11=1),1,(IF(AND($C$1=1,$C$2=2,C11=1),2,(IF(AND($C$1=1,$C$2=3,C11=1),3,(IF(AND($C$1=2,$C$2=1,C11=1),4,(IF(AND($C$1=2,$C$2=2,C11=1),5,(IF(AND($C$1=2,$C$2=3,C11=1),6,(IF(AND($C$1=1,$C$2=1,C11=2),7,(IF(AND($C$1=1,$C$2=2,C11=2),8,(IF(AND($C$1=1,$C$2=3,C11=2),9,(IF(AND($C$1=2,$C$2=1,C11=2),10,(IF(AND($C$1=2,$C$2=2,C11=2),11,(IF(AND($C$1=2,$C$2=3,C11=2),12,\"\")))))))))))))))))))))))","v":7},{"$f":"CHOOSE(H11,VLOOKUP(D11,DATA!$B$2:$N$25,2,FALSE),VLOOKUP(D11,DATA!$B$2:$N$25,3,FALSE),VLOOKUP(D11,DATA!$B$2:$N$25,4,FALSE),VLOOKUP(D11,DATA!$B$2:$N$25,5,FALSE),VLOOKUP(D11,DATA!$B$2:$N$25,6,FALSE),VLOOKUP(D11,DATA!$B$2:$N$25,7,FALSE),VLOOKUP(D11,DATA!$B$2:$N$25,8,FALSE),VLOOKUP(D11,DATA!$B$2:$N$25,9,FALSE),VLOOKUP(D11,DATA!$B$2:$N$25,10,FALSE),VLOOKUP(D11,DATA!$B$2:$N$25,11,FALSE),VLOOKUP(D11,DATA!$B$2:$N$25,12,FALSE),VLOOKUP(D11,DATA!$B$2:$N$25,13,FALSE),\"\")*(IF(F11=1,1,0))","v":0},{"$f":"CHOOSE(H11,VLOOKUP(D11,DATA!$B$27:$N$50,2,FALSE),VLOOKUP(D11,DATA!$B$27:$N$50,3,FALSE),VLOOKUP(D11,DATA!$B$27:$N$50,4,FALSE),VLOOKUP(D11,DATA!$B$27:$N$50,5,FALSE),VLOOKUP(D11,DATA!$B$27:$N$50,6,FALSE),VLOOKUP(D11,DATA!$B$27:$N$50,7,FALSE),VLOOKUP(D11,DATA!$B$27:$N$50,8,FALSE),VLOOKUP(D11,DATA!$B$27:$N$50,9,FALSE),VLOOKUP(D11,DATA!$B$27:$N$50,10,FALSE),VLOOKUP(D11,DATA!$B$27:$N$50,11,FALSE),VLOOKUP(D11,DATA!$B$27:$N$50,12,FALSE),VLOOKUP(D11,DATA!$B$27:$N$50,13,FALSE),\"\")*(IF(F12=1,1,0))","v":0},{"$f":"CHOOSE(H11,VLOOKUP(D11,DATA!$B$52:$N$75,2,FALSE),VLOOKUP(D11,DATA!$B$52:$N$75,3,FALSE),VLOOKUP(D11,DATA!$B$52:$N$75,4,FALSE),VLOOKUP(D11,DATA!$B$52:$N$77,5,FALSE),VLOOKUP(D11,DATA!$B$52:$N$75,6,FALSE),VLOOKUP(D11,DATA!$B$52:$N$75,7,FALSE),VLOOKUP(D11,DATA!$B$52:$N$75,8,FALSE),VLOOKUP(D11,DATA!$B$52:$N$75,9,FALSE),VLOOKUP(D11,DATA!$B$52:$N$75,10,FALSE),VLOOKUP(D11,DATA!$B$52:$N$75,11,FALSE),VLOOKUP(D11,DATA!$B$52:$N$75,12,FALSE),VLOOKUP(D11,DATA!$B$52:$N$75,13,FALSE),\"\")*(IF(F13=1,1,0))","v":0},{"$f":"CHOOSE(H11,VLOOKUP(D11,DATA!$B$77:$N$100,2,FALSE),VLOOKUP(D11,DATA!$B$77:$N$100,3,FALSE),VLOOKUP(D11,DATA!$B$77:$N$100,4,FALSE),VLOOKUP(D11,DATA!$B$77:$N$100,5,FALSE),VLOOKUP(D11,DATA!$B$77:$N$100,6,FALSE),VLOOKUP(D11,DATA!$B$77:$N$100,7,FALSE),VLOOKUP(D11,DATA!$B$77:$N$100,8,FALSE),VLOOKUP(D11,DATA!$B$77:$N$100,9,FALSE),VLOOKUP(D11,DATA!$B$77:$N$100,10,FALSE),VLOOKUP(D11,DATA!$B$77:$N$100,11,FALSE),VLOOKUP(D11,DATA!$B$77:$N$100,12,FALSE),VLOOKUP(D11,DATA!$B$77:$N$100,13,FALSE),\"\")*(IF(F14=1,1,0))","v":0},{"$f":"CHOOSE(H11,VLOOKUP(D11,DATA!$B$102:$N$125,2,FALSE),VLOOKUP(D11,DATA!$B$102:$N$125,3,FALSE),VLOOKUP(D11,DATA!$B$102:$N$125,4,FALSE),VLOOKUP(D11,DATA!$B$102:$N$125,5,FALSE),VLOOKUP(D11,DATA!$B$102:$N$125,6,FALSE),VLOOKUP(D11,DATA!$B$102:$N$125,7,FALSE),VLOOKUP(D11,DATA!$B$102:$N$125,8,FALSE),VLOOKUP(D11,DATA!$B$102:$N$125,9,FALSE),VLOOKUP(D11,DATA!$B$102:$N$125,10,FALSE),VLOOKUP(D11,DATA!$B$102:$N$125,11,FALSE),VLOOKUP(D11,DATA!$B$102:$N$125,12,FALSE),VLOOKUP(D11,DATA!$B$102:$N$125,13,FALSE),\"\")*(IF(F14=1,1,0))","v":0},{"$f":"利用申込書1!AG29","v":""},{"$f":"IF(AND(F12=1,F13=1,F14=1),\"午前-午後-夜間\",(IF(AND(F12=1,F13=1,F14=2),\"午前-午後\",(IF(AND(F12=2,F13=1,F14=1),\"午後-夜間\",(IF(AND(F12=1,F13=2,F14=2),\"午前\",(IF(AND(F12=2,F13=1,F14=2),\"午後\",IF(AND(F12=1,F13=2,F14=1),\"午前・夜間\",\"夜間\"))))))))))","v":"夜間"},null,{"$f":"IF(I11>0,VLOOKUP(O11,$A$235:$B$238,2,FALSE),VLOOKUP(O11,$A$226:$B$232,2,FALSE))","v":"18:00-21:00"},{"$f":"IF(B11=B7,\"\",B11)","v":""},{"$f":"B11","v":"00:00:00"},{"$f":"YEAR(S11)","v":1900},"年",{"$f":"T11&U11&T12&U12","v":"1900年1月"},{"$f":"IF(AND(F12=1,F13=1,F14=1),\"APN\",(IF(AND(F12=1,F13=1,F14=2),\"AP\",(IF(AND(F12=2,F13=1,F14=1),\"PN\",(IF(AND(F12=1,F13=2,F14=2),\"A\",(IF(AND(F12=2,F13=1,F14=2),\"P\",\"N\")))))))))","v":"N"},{"$f":"利用申込書1!$AV$50","v":""},{"$f":"X12&W11&\"・\"&AB11","v":"0N・"},{"$f":"T11&U11","v":"1900年"},{"$f":"Z11&V12","v":"1900年1月0日"},{"$f":"CLEAN(X11)","v":""}]
[null,{"$f":"TEXT(B11,\"YYYY\")","v":"1900"},null,null,"チェック2",{"$f":"IF(F11=1,1,IF(G12,1,2))","v":2},false,null,null,{"$f":"B14&J6","v":"0A"},{"$f":"B14&$K$6","v":"0P"},{"$f":"B14&$L$6","v":"0N"},null,null,null,null,{"$f":"LEFT(Q11,2)","v":"18"},null,{"$f":"B11","v":"00:00:00"},{"$f":"MONTH(S11)","v":1},"月",{"$f":"T12&U12&T13&U13","v":"1月0日"},{"$f":"D11","v":0},{"$f":"LEFT(W12,3)","v":"0"}]
[null,{"$f":"TEXT(B11,\"YYYYmm\")","v":"190001"},null,null,"チェック3",2,false,null,null,{"$f":"G12","v":false},{"$f":"G13","v":false},{"$f":"G14","v":false},null,null,null,null,{"$f":"IF(MID(Q11,6,1)=\"-\",MID(Q11,7,2),MID(Q11,6,2))","v":"21"},null,null,{"$f":"DAY(S11)","v":0},"日",{"$f":"T13&U13","v":"0日"}]
[null,{"$f":"TEXT(B11,\"d\")","v":"0"},null,null,"チェック4",2,false,null,null,null,null,null,null,null,null,null,null,null,null,null,null,{"$f":"T12&U12","v":"1月"}]
[{"$f":"IF(D15=\"大会議室(準備)\",\"大会議室\",(IF(D15=\"大会議室(本番)\",\"大会議室\",(IF(D15=\"ピアザホール(準備)\",\"PH\",IF(D15=\"ピアザホール(本番)\",\"PH\",IF(D15=\"練習室(一般)\",\"練習室\",IF(D15=\"練習室(学生)\",\"練習室\",D15))))))))","v":0},{"$f":"IF(利用申込書1!A31=\"\", B11,利用申込書1!A31)","v":"00:00:00"},{"$f":"IF(OR((WEEKDAY(B15,2)>=6),COUNTIF(DATA!$Q$3:$T$23,B15)),2,1)","v":2},{"$f":"利用申込書1!F31","v":0},"チェック1",{"$f":"IF(G15,1,2)","v":2},false,{"$f":"IF(AND($C$1=1,$C$2=1,C15=1),1,(IF(AND($C$1=1,$C$2=2,C15=1),2,(IF(AND($C$1=1,$C$2=3,C15=1),3,(IF(AND($C$1=2,$C$2=1,C15=1),4,(IF(AND($C$1=2,$C$2=2,C15=1),5,(IF(AND($C$1=2,$C$2=3,C15=1),6,(IF(AND($C$1=1,$C$2=1,C15=2),7,(IF(AND($C$1=1,$C$2=2,C15=2),8,(IF(AND($C$1=1,$C$2=3,C15=2),9,(IF(AND($C$1=2,$C$2=1,C15=2),10,(IF(AND($C$1=2,$C$2=2,C15=2),11,(IF(AND($C$1=2,$C$2=3,C15=2),12,\"\")))))))))))))))))))))))","v":7},{"$f":"CHOOSE(H15,VLOOKUP(D15,DATA!$B$2:$N$25,2,FALSE),VLOOKUP(D15,DATA!$B$2:$N$25,3,FALSE),VLOOKUP(D15,DATA!$B$2:$N$25,4,FALSE),VLOOKUP(D15,DATA!$B$2:$N$25,5,FALSE),VLOOKUP(D15,DATA!$B$2:$N$25,6,FALSE),VLOOKUP(D15,DATA!$B$2:$N$25,7,FALSE),VLOOKUP(D15,DATA!$B$2:$N$25,8,FALSE),VLOOKUP(D15,DATA!$B$2:$N$25,9,FALSE),VLOOKUP(D15,DATA!$B$2:$N$25,10,FALSE),VLOOKUP(D15,DATA!$B$2:$N$25,11,FALSE),VLOOKUP(D15,DATA!$B$2:$N$25,12,FALSE),VLOOKUP(D15,DATA!$B$2:$N$25,13,FALSE),\"\")*(IF(F15=1,1,0))","v":0},{"$f":"CHOOSE(H15,VLOOKUP(D15,DATA!$B$27:$N$50,2,FALSE),VLOOKUP(D15,DATA!$B$27:$N$50,3,FALSE),VLOOKUP(D15,DATA!$B$27:$N$50,4,FALSE),VLOOKUP(D15,DATA!$B$27:$N$50,5,FALSE),VLOOKUP(D15,DATA!$B$27:$N$50,6,FALSE),VLOOKUP(D15,DATA!$B$27:$N$50,7,FALSE),VLOOKUP(D15,DATA!$B$27:$N$50,8,FALSE),VLOOKUP(D15,DATA!$B$27:$N$50,9,FALSE),VLOOKUP(D15,DATA!$B$27:$N$50,10,FALSE),VLOOKUP(D15,DATA!$B$27:$N$50,11,FALSE),VLOOKUP(D15,DATA!$B$27:$N$50,12,FALSE),VLOOKUP(D15,DATA!$B$27:$N$50,13,FALSE),\"\")*(IF(F16=1,1,0))","v":0},{"$f":"CHOOSE(H15,VLOOKUP(D15,DATA!$B$52:$N$75,2,FALSE),VLOOKUP(D15,DATA!$B$52:$N$75,3,FALSE),VLOOKUP(D15,DATA!$B$52:$N$75,4,FALSE),VLOOKUP(D15,DATA!$B$52:$N$77,5,FALSE),VLOOKUP(D15,DATA!$B$52:$N$75,6,FALSE),VLOOKUP(D15,DATA!$B$52:$N$75,7,FALSE),VLOOKUP(D15,DATA!$B$52:$N$75,8,FALSE),VLOOKUP(D15,DATA!$B$52:$N$75,9,FALSE),VLOOKUP(D15,DATA!$B$52:$N$75,10,FALSE),VLOOKUP(D15,DATA!$B$52:$N$75,11,FALSE),VLOOKUP(D15,DATA!$B$52:$N$75,12,FALSE),VLOOKUP(D15,DATA!$B$52:$N$75,13,FALSE),\"\")*(IF(F17=1,1,0))","v":0},{"$f":"CHOOSE(H15,VLOOKUP(D15,DATA!$B$77:$N$100,2,FALSE),VLOOKUP(D15,DATA!$B$77:$N$100,3,FALSE),VLOOKUP(D15,DATA!$B$77:$N$100,4,FALSE),VLOOKUP(D15,DATA!$B$77:$N$100,5,FALSE),VLOOKUP(D15,DATA!$B$77:$N$100,6,FALSE),VLOOKUP(D15,DATA!$B$77:$N$100,7,FALSE),VLOOKUP(D15,DATA!$B$77:$N$100,8,FALSE),VLOOKUP(D15,DATA!$B$77:$N$100,9,FALSE),VLOOKUP(D15,DATA!$B$77:$N$100,10,FALSE),VLOOKUP(D15,DATA!$B$77:$N$100,11,FALSE),VLOOKUP(D15,DATA!$B$77:$N$100,12,FALSE),VLOOKUP(D15,DATA!$B$77:$N$100,13,FALSE),\"\")*(IF(F18=1,1,0))","v":0},{"$f":"CHOOSE(H15,VLOOKUP(D15,DATA!$B$102:$N$125,2,FALSE),VLOOKUP(D15,DATA!$B$102:$N$125,3,FALSE),VLOOKUP(D15,DATA!$B$102:$N$125,4,FALSE),VLOOKUP(D15,DATA!$B$102:$N$125,5,FALSE),VLOOKUP(D15,DATA!$B$102:$N$125,6,FALSE),VLOOKUP(D15,DATA!$B$102:$N$125,7,FALSE),VLOOKUP(D15,DATA!$B$102:$N$125,8,FALSE),VLOOKUP(D15,DATA!$B$102:$N$125,9,FALSE),VLOOKUP(D15,DATA!$B$102:$N$125,10,FALSE),VLOOKUP(D15,DATA!$B$102:$N$125,11,FALSE),VLOOKUP(D15,DATA!$B$102:$N$125,12,FALSE),VLOOKUP(D15,DATA!$B$102:$N$125,13,FALSE),\"\")*(IF(F18=1,1,0))","v":0},{"$f":"利用申込書1!AG31","v":""},{"$f":"IF(AND(F16=1,F17=1,F18=1),\"午前-午後-夜間\",(IF(AND(F16=1,F17=1,F18=2),\"午前-午後\",(IF(AND(F16=2,F17=1,F18=1),\"午後-夜間\",(IF(AND(F16=1,F17=2,F18=2),\"午前\",(IF(AND(F16=2,F17=1,F18=2),\"午後\",IF(AND(F16=1,F17=2,F18=1),\"午前・夜間\",\"夜間\"))))))))))","v":"夜間"},null,{"$f":"IF(I15>0,VLOOKUP(O15,$A$235:$B$238,2,FALSE),VLOOKUP(O15,$A$226:$B$232,2,FALSE))","v":"18:00-21:00"},{"$f":"IF(B15=B11,\"\",B15)","v":""},{"$f":"B15","v":"00:00:00"},{"$f":"YEAR(S15)","v":1900},"年",{"$f":"T15&U15&T16&U16","v":"1900年1月"},{"$f":"IF(AND(F16=1,F17=1,F18=1),\"APN\",(IF(AND(F16=1,F17=1,F18=2),\"AP\",(IF(AND(F16=2,F17=1,F18=1),\"PN\",(IF(AND(F16=1,F17=2,F18=2),\"A\",(IF(AND(F16=2,F17=1,F18=2),\"P\",\"N\")))))))))","v":"N"},{"$f":"利用申込書1!$AV$50","v":""},{"$f":"X16&W15&\"・\"&AB15","v":"0N・"},{"$f":"T15&U15","v":"1900年"},{"$f":"Z15&V16","v":"1900年1月0日"},{"$f":"CLEAN(X15)","v":""}]
[null,{"$f":"TEXT(B15,\"YYYY\")","v":"1900"},null,null,"チェック2",{"$f":"IF(F15=1,1,IF(G16,1,2))","v":2},false,null,null,{"$f":"B18&$J$6","v":"0A"},{"$f":"B18&$K$6","v":"0P"},{"$f":"B18&$L$6","v":"0N"},null,null,null,null,{"$f":"LEFT(Q15,2)","v":"18"},null,{"$f":"B15","v":"00:00:00"},{"$f":"MONTH(S15)","v":1},"月",{"$f":"T16&U16&T17&U17","v":"1月0日"},{"$f":"D15","v":0},{"$f":"LEFT(W16,3)","v":"0"}]
[null,{"$f":"TEXT(B15,\"YYYYmm\")","v":"190001"},null,null,"チェック3",2,false,null,null,{"$f":"G16","v":false},{"$f":"G17","v":false},{"$f":"G18","v":false},null,null,null,null,{"$f":"IF(MID(Q15,6,1)=\"-\",MID(Q15,7,2),MID(Q15,6,2))","v":"21"},null,null,{"$f":"DAY(S15)","v":0},"日",{"$f":"T17&U17","v":"0日"}]
[null,{"$f":"TEXT(B15,\"d\")","v":"0"},null,null,"チェック4",2,false,null,null,null,null,null,null,null,null,null,null,null,null,null,null,{"$f":"T16&U16","v":"1月"}]
[{"$f":"IF(D19=\"大会議室(準備)\",\"大会議室\",(IF(D19=\"大会議室(本番)\",\"大会議室\",(IF(D19=\"ピアザホール(準備)\",\"PH\",IF(D19=\"ピアザホール(本番)\",\"PH\",IF(D19=\"練習室(一般)\",\"練習室\",IF(D19=\"練習室(学生)\",\"練習室\",D19))))))))","v":0},{"$f":"IF(利用申込書1!A33=\"\", B15,利用申込書1!A33)","v":"00:00:00"},{"$f":"IF(OR((WEEKDAY(B19,2)>=6),COUNTIF(DATA!$Q$3:$T$23,B19)),2,1)","v":2},{"$f":"利用申込書1!F33","v":0},"チェック1",2,false,{"$f":"IF(AND($C$1=1,$C$2=1,C19=1),1,(IF(AND($C$1=1,$C$2=2,C19=1),2,(IF(AND($C$1=1,$C$2=3,C19=1),3,(IF(AND($C$1=2,$C$2=1,C19=1),4,(IF(AND($C$1=2,$C$2=2,C19=1),5,(IF(AND($C$1=2,$C$2=3,C19=1),6,(IF(AND($C$1=1,$C$2=1,C19=2),7,(IF(AND($C$1=1,$C$2=2,C19=2),8,(IF(AND($C$1=1,$C$2=3,C19=2),9,(IF(AND($C$1=2,$C$2=1,C19=2),10,(IF(AND($C$1=2,$C$2=2,C19=2),11,(IF(AND($C$1=2,$C$2=3,C19=2),12,\"\")))))))))))))))))))))))","v":7},{"$f":"CHOOSE(H19,VLOOKUP(D19,DATA!$B$2:$N$25,2,FALSE),VLOOKUP(D19,DATA!$B$2:$N$25,3,FALSE),VLOOKUP(D19,DATA!$B$2:$N$25,4,FALSE),VLOOKUP(D19,DATA!$B$2:$N$25,5,FALSE),VLOOKUP(D19,DATA!$B$2:$N$25,6,FALSE),VLOOKUP(D19,DATA!$B$2:$N$25,7,FALSE),VLOOKUP(D19,DATA!$B$2:$N$25,8,FALSE),VLOOKUP(D19,DATA!$B$2:$N$25,9,FALSE),VLOOKUP(D19,DATA!$B$2:$N$25,10,FALSE),VLOOKUP(D19,DATA!$B$2:$N$25,11,FALSE),VLOOKUP(D19,DATA!$B$2:$N$25,12,FALSE),VLOOKUP(D19,DATA!$B$2:$N$25,13,FALSE),\"\")*(IF(F19=1,1,0))","v":0},{"$f":"CHOOSE(H19,VLOOKUP(D19,DATA!$B$27:$N$50,2,FALSE),VLOOKUP(D19,DATA!$B$27:$N$50,3,FALSE),VLOOKUP(D19,DATA!$B$27:$N$50,4,FALSE),VLOOKUP(D19,DATA!$B$27:$N$50,5,FALSE),VLOOKUP(D19,DATA!$B$27:$N$50,6,FALSE),VLOOKUP(D19,DATA!$B$27:$N$50,7,FALSE),VLOOKUP(D19,DATA!$B$27:$N$50,8,FALSE),VLOOKUP(D19,DATA!$B$27:$N$50,9,FALSE),VLOOKUP(D19,DATA!$B$27:$N$50,10,FALSE),VLOOKUP(D19,DATA!$B$27:$N$50,11,FALSE),VLOOKUP(D19,DATA!$B$27:$N$50,12,FALSE),VLOOKUP(D19,DATA!$B$27:$N$50,13,FALSE),\"\")*(IF(F20=1,1,0))","v":0},{"$f":"CHOOSE(H19,VLOOKUP(D19,DATA!$B$52:$N$75,2,FALSE),VLOOKUP(D19,DATA!$B$52:$N$75,3,FALSE),VLOOKUP(D19,DATA!$B$52:$N$75,4,FALSE),VLOOKUP(D19,DATA!$B$52:$N$77,5,FALSE),VLOOKUP(D19,DATA!$B$52:$N$75,6,FALSE),VLOOKUP(D19,DATA!$B$52:$N$75,7,FALSE),VLOOKUP(D19,DATA!$B$52:$N$75,8,FALSE),VLOOKUP(D19,DATA!$B$52:$N$75,9,FALSE),VLOOKUP(D19,DATA!$B$52:$N$75,10,FALSE),VLOOKUP(D19,DATA!$B$52:$N$75,11,FALSE),VLOOKUP(D19,DATA!$B$52:$N$75,12,FALSE),VLOOKUP(D19,DATA!$B$52:$N$75,13,FALSE),\"\")*(IF(F21=1,1,0))","v":0},{"$f":"CHOOSE(H19,VLOOKUP(D19,DATA!$B$77:$N$100,2,FALSE),VLOOKUP(D19,DATA!$B$77:$N$100,3,FALSE),VLOOKUP(D19,DATA!$B$77:$N$100,4,FALSE),VLOOKUP(D19,DATA!$B$77:$N$100,5,FALSE),VLOOKUP(D19,DATA!$B$77:$N$100,6,FALSE),VLOOKUP(D19,DATA!$B$77:$N$100,7,FALSE),VLOOKUP(D19,DATA!$B$77:$N$100,8,FALSE),VLOOKUP(D19,DATA!$B$77:$N$100,9,FALSE),VLOOKUP(D19,DATA!$B$77:$N$100,10,FALSE),VLOOKUP(D19,DATA!$B$77:$N$100,11,FALSE),VLOOKUP(D19,DATA!$B$77:$N$100,12,FALSE),VLOOKUP(D19,DATA!$B$77:$N$100,13,FALSE),\"\")*(IF(F22=1,1,0))","v":0},{"$f":"CHOOSE(H19,VLOOKUP(D19,DATA!$B$102:$N$125,2,FALSE),VLOOKUP(D19,DATA!$B$102:$N$125,3,FALSE),VLOOKUP(D19,DATA!$B$102:$N$125,4,FALSE),VLOOKUP(D19,DATA!$B$102:$N$125,5,FALSE),VLOOKUP(D19,DATA!$B$102:$N$125,6,FALSE),VLOOKUP(D19,DATA!$B$102:$N$125,7,FALSE),VLOOKUP(D19,DATA!$B$102:$N$125,8,FALSE),VLOOKUP(D19,DATA!$B$102:$N$125,9,FALSE),VLOOKUP(D19,DATA!$B$102:$N$125,10,FALSE),VLOOKUP(D19,DATA!$B$102:$N$125,11,FALSE),VLOOKUP(D19,DATA!$B$102:$N$125,12,FALSE),VLOOKUP(D19,DATA!$B$102:$N$125,13,FALSE),\"\")*(IF(F22=1,1,0))","v":0},{"$f":"利用申込書1!AG33","v":""},{"$f":"IF(AND(F20=1,F21=1,F22=1),\"午前-午後-夜間\",(IF(AND(F20=1,F21=1,F22=2),\"午前-午後\",(IF(AND(F20=2,F21=1,F22=1),\"午後-夜間\",(IF(AND(F20=1,F21=2,F22=2),\"午前\",(IF(AND(F20=2,F21=1,F22=2),\"午後\",IF(AND(F20=1,F21=2,F22=1),\"午前・夜間\",\"夜間\"))))))))))","v":"夜間"},null,{"$f":"IF(I19>0,VLOOKUP(O19,$A$235:$B$238,2,FALSE),VLOOKUP(O19,$A$226:$B$232,2,FALSE))","v":"18:00-21:00"},{"$f":"IF(B19=B15,\"\",B19)","v":""},{"$f":"B19","v":"00:00:00"},{"$f":"YEAR(S19)","v":1900},"年",{"$f":"T19&U19&T20&U20","v":"1900年1月"},{"$f":"IF(AND(F20=1,F21=1,F22=1),\"APN\",(IF(AND(F20=1,F21=1,F22=2),\"AP\",(IF(AND(F20=2,F21=1,F22=1),\"PN\",(IF(AND(F20=1,F21=2,F22=2),\"A\",(IF(AND(F20=2,F21=1,F22=2),\"P\",\"N\")))))))))","v":"N"},{"$f":"利用申込書1!$AV$50","v":""},{"$f":"X20&W19&\"・\"&AB19","v":"0N・"},{"$f":"T19&U19","v":"1900年"},{"$f":"Z19&V20","v":"1900年1月0日"},{"$f":"CLEAN(X19)","v":""}]
[null,{"$f":"TEXT(B19,\"YYYY\")","v":"1900"},null,null,"チェック2",{"$f":"IF(F19=1,1,IF(G20,1,2))","v":2},false,null,null,{"$f":"B22&$J$6","v":"0A"},{"$f":"B22&$K$6","v":"0P"},{"$f":"B22&$L$6","v":"0N"},null,null,null,null,{"$f":"LEFT(Q19,2)","v":"18"},null,{"$f":"B19","v":"00:00:00"},{"$f":"MONTH(S19)","v":1},"月",{"$f":"T20&U20&T21&U21","v":"1月0日"},{"$f":"D19","v":0},{"$f":"LEFT(W20,3)","v":"0"}]
[null,{"$f":"TEXT(B19,\"YYYYmm\")","v":"190001"},null,null,"チェック3",2,false,null,null,{"$f":"G20","v":false},{"$f":"G21","v":false},{"$f":"G22","v":false},null,null,null,null,{"$f":"IF(MID(Q19,6,1)=\"-\",MID(Q19,7,2),MID(Q19,6,2))","v":"21"},null,null,{"$f":"DAY(S19)","v":0},"日",{"$f":"T21&U21","v":"0日"}]
[null,{"$f":"TEXT(B19,\"d\")","v":"0"},null,null,"チェック4",2,false,null,null,null,null,null,null,null,null,null,null,null,null,null,null,{"$f":"T20&U20","v":"1月"}]
[{"$f":"IF(D23=\"大会議室(準備)\",\"大会議室\",(IF(D23=\"大会議室(本番)\",\"大会議室\",(IF(D23=\"ピアザホール(準備)\",\"PH\",IF(D23=\"ピアザホール(本番)\",\"PH\",IF(D23=\"練習室(一般)\",\"練習室\",IF(D23=\"練習室(学生)\",\"練習室\",D23))))))))","v":0},{"$f":"IF(利用申込書1!A35=\"\", B19,利用申込書1!A35)","v":"00:00:00"},{"$f":"IF(OR((WEEKDAY(B23,2)>=6),COUNTIF(DATA!$Q$3:$T$23,B23)),2,1)","v":2},{"$f":"利用申込書1!F35","v":0},"チェック1",2,false,{"$f":"IF(AND($C$1=1,$C$2=1,C23=1),1,(IF(AND($C$1=1,$C$2=2,C23=1),2,(IF(AND($C$1=1,$C$2=3,C23=1),3,(IF(AND($C$1=2,$C$2=1,C23=1),4,(IF(AND($C$1=2,$C$2=2,C23=1),5,(IF(AND($C$1=2,$C$2=3,C23=1),6,(IF(AND($C$1=1,$C$2=1,C23=2),7,(IF(AND($C$1=1,$C$2=2,C23=2),8,(IF(AND($C$1=1,$C$2=3,C23=2),9,(IF(AND($C$1=2,$C$2=1,C23=2),10,(IF(AND($C$1=2,$C$2=2,C23=2),11,(IF(AND($C$1=2,$C$2=3,C23=2),12,\"\")))))))))))))))))))))))","v":7},{"$f":"CHOOSE(H23,VLOOKUP(D23,DATA!$B$2:$N$25,2,FALSE),VLOOKUP(D23,DATA!$B$2:$N$25,3,FALSE),VLOOKUP(D23,DATA!$B$2:$N$25,4,FALSE),VLOOKUP(D23,DATA!$B$2:$N$25,5,FALSE),VLOOKUP(D23,DATA!$B$2:$N$25,6,FALSE),VLOOKUP(D23,DATA!$B$2:$N$25,7,FALSE),VLOOKUP(D23,DATA!$B$2:$N$25,8,FALSE),VLOOKUP(D23,DATA!$B$2:$N$25,9,FALSE),VLOOKUP(D23,DATA!$B$2:$N$25,10,FALSE),VLOOKUP(D23,DATA!$B$2:$N$25,11,FALSE),VLOOKUP(D23,DATA!$B$2:$N$25,12,FALSE),VLOOKUP(D23,DATA!$B$2:$N$25,13,FALSE),\"\")*(IF(F23=1,1,0))","v":0},{"$f":"CHOOSE(H23,VLOOKUP(D23,DATA!$B$27:$N$50,2,FALSE),VLOOKUP(D23,DATA!$B$27:$N$50,3,FALSE),VLOOKUP(D23,DATA!$B$27:$N$50,4,FALSE),VLOOKUP(D23,DATA!$B$27:$N$50,5,FALSE),VLOOKUP(D23,DATA!$B$27:$N$50,6,FALSE),VLOOKUP(D23,DATA!$B$27:$N$50,7,FALSE),VLOOKUP(D23,DATA!$B$27:$N$50,8,FALSE),VLOOKUP(D23,DATA!$B$27:$N$50,9,FALSE),VLOOKUP(D23,DATA!$B$27:$N$50,10,FALSE),VLOOKUP(D23,DATA!$B$27:$N$50,11,FALSE),VLOOKUP(D23,DATA!$B$27:$N$50,12,FALSE),VLOOKUP(D23,DATA!$B$27:$N$50,13,FALSE),\"\")*(IF(F24=1,1,0))","v":0},{"$f":"CHOOSE(H23,VLOOKUP(D23,DATA!$B$52:$N$75,2,FALSE),VLOOKUP(D23,DATA!$B$52:$N$75,3,FALSE),VLOOKUP(D23,DATA!$B$52:$N$75,4,FALSE),VLOOKUP(D23,DATA!$B$52:$N$77,5,FALSE),VLOOKUP(D23,DATA!$B$52:$N$75,6,FALSE),VLOOKUP(D23,DATA!$B$52:$N$75,7,FALSE),VLOOKUP(D23,DATA!$B$52:$N$75,8,FALSE),VLOOKUP(D23,DATA!$B$52:$N$75,9,FALSE),VLOOKUP(D23,DATA!$B$52:$N$75,10,FALSE),VLOOKUP(D23,DATA!$B$52:$N$75,11,FALSE),VLOOKUP(D23,DATA!$B$52:$N$75,12,FALSE),VLOOKUP(D23,DATA!$B$52:$N$75,13,FALSE),\"\")*(IF(F25=1,1,0))","v":0},{"$f":"CHOOSE(H23,VLOOKUP(D23,DATA!$B$77:$N$100,2,FALSE),VLOOKUP(D23,DATA!$B$77:$N$100,3,FALSE),VLOOKUP(D23,DATA!$B$77:$N$100,4,FALSE),VLOOKUP(D23,DATA!$B$77:$N$100,5,FALSE),VLOOKUP(D23,DATA!$B$77:$N$100,6,FALSE),VLOOKUP(D23,DATA!$B$77:$N$100,7,FALSE),VLOOKUP(D23,DATA!$B$77:$N$100,8,FALSE),VLOOKUP(D23,DATA!$B$77:$N$100,9,FALSE),VLOOKUP(D23,DATA!$B$77:$N$100,10,FALSE),VLOOKUP(D23,DATA!$B$77:$N$100,11,FALSE),VLOOKUP(D23,DATA!$B$77:$N$100,12,FALSE),VLOOKUP(D23,DATA!$B$77:$N$100,13,FALSE),\"\")*(IF(F26=1,1,0))","v":0},{"$f":"CHOOSE(H23,VLOOKUP(D23,DATA!$B$102:$N$125,2,FALSE),VLOOKUP(D23,DATA!$B$102:$N$125,3,FALSE),VLOOKUP(D23,DATA!$B$102:$N$125,4,FALSE),VLOOKUP(D23,DATA!$B$102:$N$125,5,FALSE),VLOOKUP(D23,DATA!$B$102:$N$125,6,FALSE),VLOOKUP(D23,DATA!$B$102:$N$125,7,FALSE),VLOOKUP(D23,DATA!$B$102:$N$125,8,FALSE),VLOOKUP(D23,DATA!$B$102:$N$125,9,FALSE),VLOOKUP(D23,DATA!$B$102:$N$125,10,FALSE),VLOOKUP(D23,DATA!$B$102:$N$125,11,FALSE),VLOOKUP(D23,DATA!$B$102:$N$125,12,FALSE),VLOOKUP(D23,DATA!$B$102:$N$125,13,FALSE),\"\")*(IF(F26=1,1,0))","v":0},{"$f":"利用申込書1!AG35","v":""},{"$f":"IF(AND(F24=1,F25=1,F26=1),\"午前-午後-夜間\",(IF(AND(F24=1,F25=1,F26=2),\"午前-午後\",(IF(AND(F24=2,F25=1,F26=1),\"午後-夜間\",(IF(AND(F24=1,F25=2,F26=2),\"午前\",(IF(AND(F24=2,F25=1,F26=2),\"午後\",IF(AND(F24=1,F25=2,F26=1),\"午前・夜間\",\"夜間\"))))))))))","v":"夜間"},null,{"$f":"IF(I23>0,VLOOKUP(O23,$A$235:$B$238,2,FALSE),VLOOKUP(O23,$A$226:$B$232,2,FALSE))","v":"18:00-21:00"},{"$f":"IF(B23=B19,\"\",B23)","v":""},{"$f":"B23","v":"00:00:00"},{"$f":"YEAR(S23)","v":1900},"年",{"$f":"T23&U23&T24&U24","v":"1900年1月"},{"$f":"IF(AND(F24=1,F25=1,F26=1),\"APN\",(IF(AND(F24=1,F25=1,F26=2),\"AP\",(IF(AND(F24=2,F25=1,F26=1),\"PN\",(IF(AND(F24=1,F25=2,F26=2),\"A\",(IF(AND(F24=2,F25=1,F26=2),\"P\",\"N\")))))))))","v":"N"},{"$f":"利用申込書1!$AV$50","v":""},{"$f":"X24&W23&\"・\"&AB23","v":"0N・"},{"$f":"T23&U23","v":"1900年"},{"$f":"Z23&V24","v":"1900年1月0日"},{"$f":"CLEAN(X23)","v":""}]
[null,{"$f":"TEXT(B23,\"YYYY\")","v":"1900"},null,null,"チェック2",{"$f":"IF(F23=1,1,IF(G24,1,2))","v":2},false,null,null,{"$f":"B26&$J$6","v":"0A"},{"$f":"B26&$K$6","v":"0P"},{"$f":"B26&$L$6","v":"0N"},null,null,null,null,{"$f":"LEFT(Q23,2)","v":"18"},null,{"$f":"B23","v":"00:00:00"},{"$f":"MONTH(S23)","v":1},"月",{"$f":"T24&U24&T25&U25","v":"1月0日"},{"$f":"D23","v":0},{"$f":"LEFT(W24,3)","v":"0"}]
[null,{"$f":"TEXT(B23,\"YYYYmm\")","v":"190001"},null,null,"チェック3",2,false,null,null,{"$f":"G24","v":false},{"$f":"G25","v":false},{"$f":"G26","v":false},null,null,null,null,{"$f":"IF(MID(Q23,6,1)=\"-\",MID(Q23,7,2),MID(Q23,6,2))","v":"21"},null,null,{"$f":"DAY(S23)","v":0},"日",{"$f":"T25&U25","v":"0日"}]
[null,{"$f":"TEXT(B23,\"d\")","v":"0"},null,null,"チェック4",2,false,null,null,null,null,null,null,null,null,null,{"$f":"LEFT(Q25,2)","v":"21"},null,null,null,null,{"$f":"T24&U24","v":"1月"}]
[{"$f":"IF(D27=\"大会議室(準備)\",\"大会議室\",(IF(D27=\"大会議室(本番)\",\"大会議室\",(IF(D27=\"ピアザホール(準備)\",\"PH\",IF(D27=\"ピアザホール(本番)\",\"PH\",IF(D27=\"練習室(一般)\",\"練習室\",IF(D27=\"練習室(学生)\",\"練習室\",D27))))))))","v":0},{"$f":"IF(利用申込書1!A37=\"\", B23,利用申込書1!A37)","v":"00:00:00"},{"$f":"IF(OR((WEEKDAY(B27,2)>=6),COUNTIF(DATA!$Q$3:$T$23,B27)),2,1)","v":2},{"$f":"利用申込書1!F37","v":0},"チェック1",2,false,{"$f":"IF(AND($C$1=1,$C$2=1,C27=1),1,(IF(AND($C$1=1,$C$2=2,C27=1),2,(IF(AND($C$1=1,$C$2=3,C27=1),3,(IF(AND($C$1=2,$C$2=1,C27=1),4,(IF(AND($C$1=2,$C$2=2,C27=1),5,(IF(AND($C$1=2,$C$2=3,C27=1),6,(IF(AND($C$1=1,$C$2=1,C27=2),7,(IF(AND($C$1=1,$C$2=2,C27=2),8,(IF(AND($C$1=1,$C$2=3,C27=2),9,(IF(AND($C$1=2,$C$2=1,C27=2),10,(IF(AND($C$1=2,$C$2=2,C27=2),11,(IF(AND($C$1=2,$C$2=3,C27=2),12,\"\")))))))))))))))))))))))","v":7},{"$f":"CHOOSE(H27,VLOOKUP(D27,DATA!$B$2:$N$25,2,FALSE),VLOOKUP(D27,DATA!$B$2:$N$25,3,FALSE),VLOOKUP(D27,DATA!$B$2:$N$25,4,FALSE),VLOOKUP(D27,DATA!$B$2:$N$25,5,FALSE),VLOOKUP(D27,DATA!$B$2:$N$25,6,FALSE),VLOOKUP(D27,DATA!$B$2:$N$25,7,FALSE),VLOOKUP(D27,DATA!$B$2:$N$25,8,FALSE),VLOOKUP(D27,DATA!$B$2:$N$25,9,FALSE),VLOOKUP(D27,DATA!$B$2:$N$25,10,FALSE),VLOOKUP(D27,DATA!$B$2:$N$25,11,FALSE),VLOOKUP(D27,DATA!$B$2:$N$25,12,FALSE),VLOOKUP(D27,DATA!$B$2:$N$25,13,FALSE),\"\")*(IF(F27=1,1,0))","v":0},{"$f":"CHOOSE(H27,VLOOKUP(D27,DATA!$B$27:$N$50,2,FALSE),VLOOKUP(D27,DATA!$B$27:$N$50,3,FALSE),VLOOKUP(D27,DATA!$B$27:$N$50,4,FALSE),VLOOKUP(D27,DATA!$B$27:$N$50,5,FALSE),VLOOKUP(D27,DATA!$B$27:$N$50,6,FALSE),VLOOKUP(D27,DATA!$B$27:$N$50,7,FALSE),VLOOKUP(D27,DATA!$B$27:$N$50,8,FALSE),VLOOKUP(D27,DATA!$B$27:$N$50,9,FALSE),VLOOKUP(D27,DATA!$B$27:$N$50,10,FALSE),VLOOKUP(D27,DATA!$B$27:$N$50,11,FALSE),VLOOKUP(D27,DATA!$B$27:$N$50,12,FALSE),VLOOKUP(D27,DATA!$B$27:$N$50,13,FALSE),\"\")*(IF(F28=1,1,0))","v":0},{"$f":"CHOOSE(H27,VLOOKUP(D27,DATA!$B$52:$N$75,2,FALSE),VLOOKUP(D27,DATA!$B$52:$N$75,3,FALSE),VLOOKUP(D27,DATA!$B$52:$N$75,4,FALSE),VLOOKUP(D27,DATA!$B$52:$N$77,5,FALSE),VLOOKUP(D27,DATA!$B$52:$N$75,6,FALSE),VLOOKUP(D27,DATA!$B$52:$N$75,7,FALSE),VLOOKUP(D27,DATA!$B$52:$N$75,8,FALSE),VLOOKUP(D27,DATA!$B$52:$N$75,9,FALSE),VLOOKUP(D27,DATA!$B$52:$N$75,10,FALSE),VLOOKUP(D27,DATA!$B$52:$N$75,11,FALSE),VLOOKUP(D27,DATA!$B$52:$N$75,12,FALSE),VLOOKUP(D27,DATA!$B$52:$N$75,13,FALSE),\"\")*(IF(F29=1,1,0))","v":0},{"$f":"CHOOSE(H27,VLOOKUP(D27,DATA!$B$77:$N$100,2,FALSE),VLOOKUP(D27,DATA!$B$77:$N$100,3,FALSE),VLOOKUP(D27,DATA!$B$77:$N$100,4,FALSE),VLOOKUP(D27,DATA!$B$77:$N$100,5,FALSE),VLOOKUP(D27,DATA!$B$77:$N$100,6,FALSE),VLOOKUP(D27,DATA!$B$77:$N$100,7,FALSE),VLOOKUP(D27,DATA!$B$77:$N$100,8,FALSE),VLOOKUP(D27,DATA!$B$77:$N$100,9,FALSE),VLOOKUP(D27,DATA!$B$77:$N$100,10,FALSE),VLOOKUP(D27,DATA!$B$77:$N$100,11,FALSE),VLOOKUP(D27,DATA!$B$77:$N$100,12,FALSE),VLOOKUP(D27,DATA!$B$77:$N$100,13,FALSE),\"\")*(IF(F30=1,1,0))","v":0},{"$f":"CHOOSE(H27,VLOOKUP(D27,DATA!$B$102:$N$125,2,FALSE),VLOOKUP(D27,DATA!$B$102:$N$125,3,FALSE),VLOOKUP(D27,DATA!$B$102:$N$125,4,FALSE),VLOOKUP(D27,DATA!$B$102:$N$125,5,FALSE),VLOOKUP(D27,DATA!$B$102:$N$125,6,FALSE),VLOOKUP(D27,DATA!$B$102:$N$125,7,FALSE),VLOOKUP(D27,DATA!$B$102:$N$125,8,FALSE),VLOOKUP(D27,DATA!$B$102:$N$125,9,FALSE),VLOOKUP(D27,DATA!$B$102:$N$125,10,FALSE),VLOOKUP(D27,DATA!$B$102:$N$125,11,FALSE),VLOOKUP(D27,DATA!$B$102:$N$125,12,FALSE),VLOOKUP(D27,DATA!$B$102:$N$125,13,FALSE),\"\")*(IF(F30=1,1,0))","v":0},{"$f":"利用申込書1!AG37","v":""},{"$f":"IF(AND(F28=1,F29=1,F30=1),\"午前-午後-夜間\",(IF(AND(F28=1,F29=1,F30=2),\"午前-午後\",(IF(AND(F28=2,F29=1,F30=1),\"午後-夜間\",(IF(AND(F28=1,F29=2,F30=2),\"午前\",(IF(AND(F28=2,F29=1,F30=2),\"午後\",IF(AND(F28=1,F29=2,F30=1),\"午前・夜間\",\"夜間\"))))))))))","v":"夜間"},null,{"$f":"IF(I27>0,VLOOKUP(O27,$A$235:$B$238,2,FALSE),VLOOKUP(O27,$A$226:$B$232,2,FALSE))","v":"18:00-21:00"},{"$f":"IF(B27=B23,\"\",B27)","v":""},{"$f":"B27","v":"00:00:00"},{"$f":"YEAR(S27)","v":1900},"年",{"$f":"T27&U27&T28&U28","v":"1900年1月"},{"$f":"IF(AND(F28=1,F29=1,F30=1),\"APN\",(IF(AND(F28=1,F29=1,F30=2),\"AP\",(IF(AND(F28=2,F29=1,F30=1),\"PN\",(IF(AND(F28=1,F29=2,F30=2),\"A\",(IF(AND(F28=2,F29=1,F30=2),\"P\",\"N\")))))))))","v":"N"},{"$f":"利用申込書1!$AV$50","v":""},{"$f":"X28&W27&\"・\"&AB27","v":"0N・"},{"$f":"T27&U27","v":"1900年"},{"$f":"Z27&V28","v":"1900年1月0日"},{"$f":"CLEAN(X27)","v":""}]
[null,{"$f":"TEXT(B27,\"YYYY\")","v":"1900"},null,null,"チェック2",{"$f":"IF(F27=1,1,IF(G28,1,2))","v":2},false,null,null,{"$f":"B30&$J$6","v":"0A"},{"$f":"B30&$K$6","v":"0P"},{"$f":"B30&$L$6","v":"0N"},null,null,null,null,{"$f":"LEFT(Q27,2)","v":"18"},null,{"$f":"B27","v":"00:00:00"},{"$f":"MONTH(S27)","v":1},"月",{"$f":"T28&U28&T29&U29","v":"1月0日"},{"$f":"D27","v":0},{"$f":"LEFT(W28,3)","v":"0"}]
[null,{"$f":"TEXT(B27,\"YYYYmm\")","v":"190001"},null,null,"チェック3",2,false,null,null,{"$f":"G28","v":false},{"$f":"G29","v":false},{"$f":"G30","v":false},null,null,null,null,{"$f":"IF(MID(Q27,6,1)=\"-\",MID(Q27,7,2),MID(Q27,6,2))","v":"21"},null,null,{"$f":"DAY(S27)","v":0},"日",{"$f":"T29&U29","v":"0日"}]
[null,{"$f":"TEXT(B27,\"d\")","v":"0"},null,null,"チェック4",2,false,null,null,null,null,null,null,null,null,null,null,null,null,null,null,{"$f":"T28&U28","v":"1月"}]
[{"$f":"IF(D31=\"大会議室(準備)\",\"大会議室\",(IF(D31=\"大会議室(本番)\",\"大会議室\",(IF(D31=\"ピアザホール(準備)\",\"PH\",IF(D31=\"ピアザホール(本番)\",\"PH\",IF(D31=\"練習室(一般)\",\"練習室\",IF(D31=\"練習室(学生)\",\"練習室\",D31))))))))","v":0},{"$f":"IF(利用申込書1!A39=\"\", B27,利用申込書1!A39)","v":"00:00:00"},{"$f":"IF(OR((WEEKDAY(B31,2)>=6),COUNTIF(DATA!$Q$3:$T$23,B31)),2,1)","v":2},{"$f":"利用申込書1!F39","v":0},"チェック1",{"$f":"IF(G31,1,2)","v":2},false,{"$f":"IF(AND($C$1=1,$C$2=1,C31=1),1,(IF(AND($C$1=1,$C$2=2,C31=1),2,(IF(AND($C$1=1,$C$2=3,C31=1),3,(IF(AND($C$1=2,$C$2=1,C31=1),4,(IF(AND($C$1=2,$C$2=2,C31=1),5,(IF(AND($C$1=2,$C$2=3,C31=1),6,(IF(AND($C$1=1,$C$2=1,C31=2),7,(IF(AND($C$1=1,$C$2=2,C31=2),8,(IF(AND($C$1=1,$C$2=3,C31=2),9,(IF(AND($C$1=2,$C$2=1,C31=2),10,(IF(AND($C$1=2,$C$2=2,C31=2),11,(IF(AND($C$1=2,$C$2=3,C31=2),12,\"\")))))))))))))))))))))))","v":7},{"$f":"CHOOSE(H31,VLOOKUP(D31,DATA!$B$2:$N$25,2,FALSE),VLOOKUP(D31,DATA!$B$2:$N$25,3,FALSE),VLOOKUP(D31,DATA!$B$2:$N$25,4,FALSE),VLOOKUP(D31,DATA!$B$2:$N$25,5,FALSE),VLOOKUP(D31,DATA!$B$2:$N$25,6,FALSE),VLOOKUP(D31,DATA!$B$2:$N$25,7,FALSE),VLOOKUP(D31,DATA!$B$2:$N$25,8,FALSE),VLOOKUP(D31,DATA!$B$2:$N$25,9,FALSE),VLOOKUP(D31,DATA!$B$2:$N$25,10,FALSE),VLOOKUP(D31,DATA!$B$2:$N$25,11,FALSE),VLOOKUP(D31,DATA!$B$2:$N$25,12,FALSE),VLOOKUP(D31,DATA!$B$2:$N$25,13,FALSE),\"\")*(IF(F31=1,1,0))","v":0},{"$f":"CHOOSE(H31,VLOOKUP(D31,DATA!$B$27:$N$50,2,FALSE),VLOOKUP(D31,DATA!$B$27:$N$50,3,FALSE),VLOOKUP(D31,DATA!$B$27:$N$50,4,FALSE),VLOOKUP(D31,DATA!$B$27:$N$50,5,FALSE),VLOOKUP(D31,DATA!$B$27:$N$50,6,FALSE),VLOOKUP(D31,DATA!$B$27:$N$50,7,FALSE),VLOOKUP(D31,DATA!$B$27:$N$50,8,FALSE),VLOOKUP(D31,DATA!$B$27:$N$50,9,FALSE),VLOOKUP(D31,DATA!$B$27:$N$50,10,FALSE),VLOOKUP(D31,DATA!$B$27:$N$50,11,FALSE),VLOOKUP(D31,DATA!$B$27:$N$50,12,FALSE),VLOOKUP(D31,DATA!$B$27:$N$50,13,FALSE),\"\")*(IF(F32=1,1,0))","v":0},{"$f":"CHOOSE(H31,VLOOKUP(D31,DATA!$B$52:$N$75,2,FALSE),VLOOKUP(D31,DATA!$B$52:$N$75,3,FALSE),VLOOKUP(D31,DATA!$B$52:$N$75,4,FALSE),VLOOKUP(D31,DATA!$B$52:$N$77,5,FALSE),VLOOKUP(D31,DATA!$B$52:$N$75,6,FALSE),VLOOKUP(D31,DATA!$B$52:$N$75,7,FALSE),VLOOKUP(D31,DATA!$B$52:$N$75,8,FALSE),VLOOKUP(D31,DATA!$B$52:$N$75,9,FALSE),VLOOKUP(D31,DATA!$B$52:$N$75,10,FALSE),VLOOKUP(D31,DATA!$B$52:$N$75,11,FALSE),VLOOKUP(D31,DATA!$B$52:$N$75,12,FALSE),VLOOKUP(D31,DATA!$B$52:$N$75,13,FALSE),\"\")*(IF(F33=1,1,0))","v":0},{"$f":"CHOOSE(H31,VLOOKUP(D31,DATA!$B$77:$N$100,2,FALSE),VLOOKUP(D31,DATA!$B$77:$N$100,3,FALSE),VLOOKUP(D31,DATA!$B$77:$N$100,4,FALSE),VLOOKUP(D31,DATA!$B$77:$N$100,5,FALSE),VLOOKUP(D31,DATA!$B$77:$N$100,6,FALSE),VLOOKUP(D31,DATA!$B$77:$N$100,7,FALSE),VLOOKUP(D31,DATA!$B$77:$N$100,8,FALSE),VLOOKUP(D31,DATA!$B$77:$N$100,9,FALSE),VLOOKUP(D31,DATA!$B$77:$N$100,10,FALSE),VLOOKUP(D31,DATA!$B$77:$N$100,11,FALSE),VLOOKUP(D31,DATA!$B$77:$N$100,12,FALSE),VLOOKUP(D31,DATA!$B$77:$N$100,13,FALSE),\"\")*(IF(F34=1,1,0))","v":0},{"$f":"CHOOSE(H31,VLOOKUP(D31,DATA!$B$102:$N$125,2,FALSE),VLOOKUP(D31,DATA!$B$102:$N$125,3,FALSE),VLOOKUP(D31,DATA!$B$102:$N$125,4,FALSE),VLOOKUP(D31,DATA!$B$102:$N$125,5,FALSE),VLOOKUP(D31,DATA!$B$102:$N$125,6,FALSE),VLOOKUP(D31,DATA!$B$102:$N$125,7,FALSE),VLOOKUP(D31,DATA!$B$102:$N$125,8,FALSE),VLOOKUP(D31,DATA!$B$102:$N$125,9,FALSE),VLOOKUP(D31,DATA!$B$102:$N$125,10,FALSE),VLOOKUP(D31,DATA!$B$102:$N$125,11,FALSE),VLOOKUP(D31,DATA!$B$102:$N$125,12,FALSE),VLOOKUP(D31,DATA!$B$102:$N$125,13,FALSE),\"\")*(IF(F34=1,1,0))","v":0},{"$f":"利用申込書1!AG39","v":""},{"$f":"IF(AND(F32=1,F33=1,F34=1),\"午前-午後-夜間\",(IF(AND(F32=1,F33=1,F34=2),\"午前-午後\",(IF(AND(F32=2,F33=1,F34=1),\"午後-夜間\",(IF(AND(F32=1,F33=2,F34=2),\"午前\",(IF(AND(F32=2,F33=1,F34=2),\"午後\",IF(AND(F32=1,F33=2,F34=1),\"午前・夜間\",\"夜間\"))))))))))","v":"夜間"},null,{"$f":"IF(I31>0,VLOOKUP(O31,$A$235:$B$238,2,FALSE),VLOOKUP(O31,$A$226:$B$232,2,FALSE))","v":"18:00-21:00"},{"$f":"IF(B31=B27,\"\",B31)","v":""},{"$f":"B31","v":"00:00:00"},{"$f":"YEAR(S31)","v":1900},"年",{"$f":"T31&U31&T32&U32","v":"1900年1月"},{"$f":"IF(AND(F32=1,F33=1,F34=1),\"APN\",(IF(AND(F32=1,F33=1,F34=2),\"AP\",(IF(AND(F32=2,F33=1,F34=1),\"PN\",(IF(AND(F32=1,F33=2,F34=2),\"A\",(IF(AND(F32=2,F33=1,F34=2),\"P\",\"N\")))))))))","v":"N"},{"$f":"利用申込書1!$AV$50","v":""},{"$f":"X32&W31&\"・\"&AB31","v":"0N・"},{"$f":"T31&U31","v":"1900年"},{"$f":"Z31&V32","v":"1900年1月0日"},{"$f":"CLEAN(X31)","v":""}]
[null,{"$f":"TEXT(B31,\"YYYY\")","v":"1900"},null,null,"チェック2",{"$f":"IF(F31=1,1,IF(G32,1,2))","v":2},false,null,null,{"$f":"B34&$J$6","v":"0A"},{"$f":"B34&$K$6","v":"0P"},{"$f":"B34&$L$6","v":"0N"},null,null,null,null,{"$f":"LEFT(Q31,2)","v":"18"},null,{"$f":"B31","v":"00:00:00"},{"$f":"MONTH(S31)","v":1},"月",{"$f":"T32&U32&T33&U33","v":"1月0日"},{"$f":"D31","v":0},{"$f":"LEFT(W32,3)","v":"0"}]
[null,{"$f":"TEXT(B31,\"YYYYmm\")","v":"190001"},null,null,"チェック3",2,false,null,null,{"$f":"G32","v":false},{"$f":"G33","v":false},{"$f":"G34","v":false},null,null,null,null,{"$f":"IF(MID(Q31,6,1)=\"-\",MID(Q31,7,2),MID(Q31,6,2))","v":"21"},null,null,{"$f":"DAY(S31)","v":0},"日",{"$f":"T33&U33","v":"0日"}]
[null,{"$f":"TEXT(B31,\"d\")","v":"0"},null,null,"チェック4",2,false,null,null,null,null,null,null,null,null,null,null,null,null,null,null,{"$f":"T32&U32","v":"1月"}]
[{"$f":"IF(D35=\"大会議室(準備)\",\"大会議室\",(IF(D35=\"大会議室(本番)\",\"大会議室\",(IF(D35=\"ピアザホール(準備)\",\"PH\",IF(D35=\"ピアザホール(本番)\",\"PH\",IF(D35=\"練習室(一般)\",\"練習室\",IF(D35=\"練習室(学生)\",\"練習室\",D35))))))))","v":0},{"$f":"IF(利用申込書1!A41=\"\", B31,利用申込書1!A41)","v":"00:00:00"},{"$f":"IF(OR((WEEKDAY(B35,2)>=6),COUNTIF(DATA!$Q$3:$T$23,B35)),2,1)","v":2},{"$f":"利用申込書1!F41","v":0},"チェック1",2,false,{"$f":"IF(AND($C$1=1,$C$2=1,C35=1),1,(IF(AND($C$1=1,$C$2=2,C35=1),2,(IF(AND($C$1=1,$C$2=3,C35=1),3,(IF(AND($C$1=2,$C$2=1,C35=1),4,(IF(AND($C$1=2,$C$2=2,C35=1),5,(IF(AND($C$1=2,$C$2=3,C35=1),6,(IF(AND($C$1=1,$C$2=1,C35=2),7,(IF(AND($C$1=1,$C$2=2,C35=2),8,(IF(AND($C$1=1,$C$2=3,C35=2),9,(IF(AND($C$1=2,$C$2=1,C35=2),10,(IF(AND($C$1=2,$C$2=2,C35=2),11,(IF(AND($C$1=2,$C$2=3,C35=2),12,\"\")))))))))))))))))))))))","v":7},{"$f":"CHOOSE(H35,VLOOKUP(D35,DATA!$B$2:$N$25,2,FALSE),VLOOKUP(D35,DATA!$B$2:$N$25,3,FALSE),VLOOKUP(D35,DATA!$B$2:$N$25,4,FALSE),VLOOKUP(D35,DATA!$B$2:$N$25,5,FALSE),VLOOKUP(D35,DATA!$B$2:$N$25,6,FALSE),VLOOKUP(D35,DATA!$B$2:$N$25,7,FALSE),VLOOKUP(D35,DATA!$B$2:$N$25,8,FALSE),VLOOKUP(D35,DATA!$B$2:$N$25,9,FALSE),VLOOKUP(D35,DATA!$B$2:$N$25,10,FALSE),VLOOKUP(D35,DATA!$B$2:$N$25,11,FALSE),VLOOKUP(D35,DATA!$B$2:$N$25,12,FALSE),VLOOKUP(D35,DATA!$B$2:$N$25,13,FALSE),\"\")*(IF(F35=1,1,0))","v":0},{"$f":"CHOOSE(H35,VLOOKUP(D35,DATA!$B$27:$N$50,2,FALSE),VLOOKUP(D35,DATA!$B$27:$N$50,3,FALSE),VLOOKUP(D35,DATA!$B$27:$N$50,4,FALSE),VLOOKUP(D35,DATA!$B$27:$N$50,5,FALSE),VLOOKUP(D35,DATA!$B$27:$N$50,6,FALSE),VLOOKUP(D35,DATA!$B$27:$N$50,7,FALSE),VLOOKUP(D35,DATA!$B$27:$N$50,8,FALSE),VLOOKUP(D35,DATA!$B$27:$N$50,9,FALSE),VLOOKUP(D35,DATA!$B$27:$N$50,10,FALSE),VLOOKUP(D35,DATA!$B$27:$N$50,11,FALSE),VLOOKUP(D35,DATA!$B$27:$N$50,12,FALSE),VLOOKUP(D35,DATA!$B$27:$N$50,13,FALSE),\"\")*(IF(F36=1,1,0))","v":0},{"$f":"CHOOSE(H35,VLOOKUP(D35,DATA!$B$52:$N$75,2,FALSE),VLOOKUP(D35,DATA!$B$52:$N$75,3,FALSE),VLOOKUP(D35,DATA!$B$52:$N$75,4,FALSE),VLOOKUP(D35,DATA!$B$52:$N$77,5,FALSE),VLOOKUP(D35,DATA!$B$52:$N$75,6,FALSE),VLOOKUP(D35,DATA!$B$52:$N$75,7,FALSE),VLOOKUP(D35,DATA!$B$52:$N$75,8,FALSE),VLOOKUP(D35,DATA!$B$52:$N$75,9,FALSE),VLOOKUP(D35,DATA!$B$52:$N$75,10,FALSE),VLOOKUP(D35,DATA!$B$52:$N$75,11,FALSE),VLOOKUP(D35,DATA!$B$52:$N$75,12,FALSE),VLOOKUP(D35,DATA!$B$52:$N$75,13,FALSE),\"\")*(IF(F37=1,1,0))","v":0},{"$f":"CHOOSE(H35,VLOOKUP(D35,DATA!$B$77:$N$100,2,FALSE),VLOOKUP(D35,DATA!$B$77:$N$100,3,FALSE),VLOOKUP(D35,DATA!$B$77:$N$100,4,FALSE),VLOOKUP(D35,DATA!$B$77:$N$100,5,FALSE),VLOOKUP(D35,DATA!$B$77:$N$100,6,FALSE),VLOOKUP(D35,DATA!$B$77:$N$100,7,FALSE),VLOOKUP(D35,DATA!$B$77:$N$100,8,FALSE),VLOOKUP(D35,DATA!$B$77:$N$100,9,FALSE),VLOOKUP(D35,DATA!$B$77:$N$100,10,FALSE),VLOOKUP(D35,DATA!$B$77:$N$100,11,FALSE),VLOOKUP(D35,DATA!$B$77:$N$100,12,FALSE),VLOOKUP(D35,DATA!$B$77:$N$100,13,FALSE),\"\")*(IF(F38=1,1,0))","v":0},{"$f":"CHOOSE(H35,VLOOKUP(D35,DATA!$B$102:$N$125,2,FALSE),VLOOKUP(D35,DATA!$B$102:$N$125,3,FALSE),VLOOKUP(D35,DATA!$B$102:$N$125,4,FALSE),VLOOKUP(D35,DATA!$B$102:$N$125,5,FALSE),VLOOKUP(D35,DATA!$B$102:$N$125,6,FALSE),VLOOKUP(D35,DATA!$B$102:$N$125,7,FALSE),VLOOKUP(D35,DATA!$B$102:$N$125,8,FALSE),VLOOKUP(D35,DATA!$B$102:$N$125,9,FALSE),VLOOKUP(D35,DATA!$B$102:$N$125,10,FALSE),VLOOKUP(D35,DATA!$B$102:$N$125,11,FALSE),VLOOKUP(D35,DATA!$B$102:$N$125,12,FALSE),VLOOKUP(D35,DATA!$B$102:$N$125,13,FALSE),\"\")*(IF(F38=1,1,0))","v":0},{"$f":"利用申込書1!AG41","v":""},{"$f":"IF(AND(F36=1,F37=1,F38=1),\"午前-午後-夜間\",(IF(AND(F36=1,F37=1,F38=2),\"午前-午後\",(IF(AND(F36=2,F37=1,F38=1),\"午後-夜間\",(IF(AND(F36=1,F37=2,F38=2),\"午前\",(IF(AND(F36=2,F37=1,F38=2),\"午後\",IF(AND(F36=1,F37=2,F38=1),\"午前・夜間\",\"夜間\"))))))))))","v":"夜間"},null,{"$f":"IF(I35>0,VLOOKUP(O35,$A$235:$B$238,2,FALSE),VLOOKUP(O35,$A$226:$B$232,2,FALSE))","v":"18:00-21:00"},{"$f":"IF(B35=B31,\"\",B35)","v":""},{"$f":"B35","v":"00:00:00"},{"$f":"YEAR(S35)","v":1900},"年",{"$f":"T35&U35&T36&U36","v":"1900年1月"},{"$f":"IF(AND(F36=1,F37=1,F38=1),\"APN\",(IF(AND(F36=1,F37=1,F38=2),\"AP\",(IF(AND(F36=2,F37=1,F38=1),\"PN\",(IF(AND(F36=1,F37=2,F38=2),\"A\",(IF(AND(F36=2,F37=1,F38=2),\"P\",\"N\")))))))))","v":"N"},{"$f":"利用申込書1!$AV$50","v":""},{"$f":"X36&W35&\"・\"&AB35","v":"0N・"},{"$f":"T35&U35","v":"1900年"},{"$f":"Z35&V36","v":"1900年1月0日"},{"$f":"CLEAN(X35)","v":""}]
[null,{"$f":"TEXT(B35,\"YYYY\")","v":"1900"},null,null,"チェック2",{"$f":"IF(F35=1,1,IF(G36,1,2))","v":2},false,null,null,{"$f":"B38&$J$6","v":"0A"},{"$f":"B38&$K$6","v":"0P"},{"$f":"B38&$L$6","v":"0N"},null,null,null,null,{"$f":"LEFT(Q35,2)","v":"18"},null,{"$f":"B35","v":"00:00:00"},{"$f":"MONTH(S35)","v":1},"月",{"$f":"T36&U36&T37&U37","v":"1月0日"},{"$f":"D35","v":0},{"$f":"LEFT(W36,3)","v":"0"}]
[null,{"$f":"TEXT(B35,\"YYYYmm\")","v":"190001"},null,null,"チェック3",2,false,null,null,{"$f":"G36","v":false},{"$f":"G37","v":false},{"$f":"G38","v":false},null,null,null,null,{"$f":"IF(MID(Q35,6,1)=\"-\",MID(Q35,7,2),MID(Q35,6,2))","v":"21"},null,null,{"$f":"DAY(S35)","v":0},"日",{"$f":"T37&U37","v":"0日"}]
["利用申し込み続き用　1ページ",{"$f":"TEXT(B35,\"d\")","v":"0"},null,null,"チェック4",2,false,null,null,null,null,null,null,null,null,null,null,null,null,null,null,{"$f":"T36&U36","v":"1月"}]
[{"$f":"IF(D39=\"大会議室(準備)\",\"大会議室\",(IF(D39=\"大会議室(本番)\",\"大会議室\",(IF(D39=\"ピアザホール(準備)\",\"PH\",IF(D39=\"ピアザホール(本番)\",\"PH\",IF(D39=\"練習室(一般)\",\"練習室\",IF(D39=\"練習室(学生)\",\"練習室\",D39))))))))","v":0},{"$f":"IF(利用申込書2!A10=\"\", B35,利用申込書2!A10)","v":"00:00:00"},{"$f":"IF(OR((WEEKDAY(B39,2)>=6),COUNTIF(DATA!$Q$3:$T$23,B39)),2,1)","v":2},{"$f":"利用申込書2!F10","v":0},"チェック1",{"$f":"IF(G39,1,2)","v":2},false,{"$f":"IF(AND($C$1=1,$C$2=1,C39=1),1,(IF(AND($C$1=1,$C$2=2,C39=1),2,(IF(AND($C$1=1,$C$2=3,C39=1),3,(IF(AND($C$1=2,$C$2=1,C39=1),4,(IF(AND($C$1=2,$C$2=2,C39=1),5,(IF(AND($C$1=2,$C$2=3,C39=1),6,(IF(AND($C$1=1,$C$2=1,C39=2),7,(IF(AND($C$1=1,$C$2=2,C39=2),8,(IF(AND($C$1=1,$C$2=3,C39=2),9,(IF(AND($C$1=2,$C$2=1,C39=2),10,(IF(AND($C$1=2,$C$2=2,C39=2),11,(IF(AND($C$1=2,$C$2=3,C39=2),12,\"\")))))))))))))))))))))))","v":7},{"$f":"CHOOSE(H39,VLOOKUP(D39,DATA!$B$2:$N$25,2,FALSE),VLOOKUP(D39,DATA!$B$2:$N$25,3,FALSE),VLOOKUP(D39,DATA!$B$2:$N$25,4,FALSE),VLOOKUP(D39,DATA!$B$2:$N$25,5,FALSE),VLOOKUP(D39,DATA!$B$2:$N$25,6,FALSE),VLOOKUP(D39,DATA!$B$2:$N$25,7,FALSE),VLOOKUP(D39,DATA!$B$2:$N$25,8,FALSE),VLOOKUP(D39,DATA!$B$2:$N$25,9,FALSE),VLOOKUP(D39,DATA!$B$2:$N$25,10,FALSE),VLOOKUP(D39,DATA!$B$2:$N$25,11,FALSE),VLOOKUP(D39,DATA!$B$2:$N$25,12,FALSE),VLOOKUP(D39,DATA!$B$2:$N$25,13,FALSE),\"\")*(IF(F39=1,1,0))","v":0},{"$f":"CHOOSE(H39,VLOOKUP(D39,DATA!$B$27:$N$50,2,FALSE),VLOOKUP(D39,DATA!$B$27:$N$50,3,FALSE),VLOOKUP(D39,DATA!$B$27:$N$50,4,FALSE),VLOOKUP(D39,DATA!$B$27:$N$50,5,FALSE),VLOOKUP(D39,DATA!$B$27:$N$50,6,FALSE),VLOOKUP(D39,DATA!$B$27:$N$50,7,FALSE),VLOOKUP(D39,DATA!$B$27:$N$50,8,FALSE),VLOOKUP(D39,DATA!$B$27:$N$50,9,FALSE),VLOOKUP(D39,DATA!$B$27:$N$50,10,FALSE),VLOOKUP(D39,DATA!$B$27:$N$50,11,FALSE),VLOOKUP(D39,DATA!$B$27:$N$50,12,FALSE),VLOOKUP(D39,DATA!$B$27:$N$50,13,FALSE),\"\")*(IF(F40=1,1,0))","v":0},{"$f":"CHOOSE(H39,VLOOKUP(D39,DATA!$B$52:$N$75,2,FALSE),VLOOKUP(D39,DATA!$B$52:$N$75,3,FALSE),VLOOKUP(D39,DATA!$B$52:$N$75,4,FALSE),VLOOKUP(D39,DATA!$B$52:$N$77,5,FALSE),VLOOKUP(D39,DATA!$B$52:$N$75,6,FALSE),VLOOKUP(D39,DATA!$B$52:$N$75,7,FALSE),VLOOKUP(D39,DATA!$B$52:$N$75,8,FALSE),VLOOKUP(D39,DATA!$B$52:$N$75,9,FALSE),VLOOKUP(D39,DATA!$B$52:$N$75,10,FALSE),VLOOKUP(D39,DATA!$B$52:$N$75,11,FALSE),VLOOKUP(D39,DATA!$B$52:$N$75,12,FALSE),VLOOKUP(D39,DATA!$B$52:$N$75,13,FALSE),\"\")*(IF(F41=1,1,0))","v":0},{"$f":"CHOOSE(H39,VLOOKUP(D39,DATA!$B$77:$N$100,2,FALSE),VLOOKUP(D39,DATA!$B$77:$N$100,3,FALSE),VLOOKUP(D39,DATA!$B$77:$N$100,4,FALSE),VLOOKUP(D39,DATA!$B$77:$N$100,5,FALSE),VLOOKUP(D39,DATA!$B$77:$N$100,6,FALSE),VLOOKUP(D39,DATA!$B$77:$N$100,7,FALSE),VLOOKUP(D39,DATA!$B$77:$N$100,8,FALSE),VLOOKUP(D39,DATA!$B$77:$N$100,9,FALSE),VLOOKUP(D39,DATA!$B$77:$N$100,10,FALSE),VLOOKUP(D39,DATA!$B$77:$N$100,11,FALSE),VLOOKUP(D39,DATA!$B$77:$N$100,12,FALSE),VLOOKUP(D39,DATA!$B$77:$N$100,13,FALSE),\"\")*(IF(F42=1,1,0))","v":0},{"$f":"CHOOSE(H39,VLOOKUP(D39,DATA!$B$102:$N$125,2,FALSE),VLOOKUP(D39,DATA!$B$102:$N$125,3,FALSE),VLOOKUP(D39,DATA!$B$102:$N$125,4,FALSE),VLOOKUP(D39,DATA!$B$102:$N$125,5,FALSE),VLOOKUP(D39,DATA!$B$102:$N$125,6,FALSE),VLOOKUP(D39,DATA!$B$102:$N$125,7,FALSE),VLOOKUP(D39,DATA!$B$102:$N$125,8,FALSE),VLOOKUP(D39,DATA!$B$102:$N$125,9,FALSE),VLOOKUP(D39,DATA!$B$102:$N$125,10,FALSE),VLOOKUP(D39,DATA!$B$102:$N$125,11,FALSE),VLOOKUP(D39,DATA!$B$102:$N$125,12,FALSE),VLOOKUP(D39,DATA!$B$102:$N$125,13,FALSE),\"\")*(IF(F42=1,1,0))","v":0},{"$f":"利用申込書2!AG10","v":""},{"$f":"IF(AND(F40=1,F41=1,F42=1),\"午前-午後-夜間\",(IF(AND(F40=1,F41=1,F42=2),\"午前-午後\",(IF(AND(F40=2,F41=1,F42=1),\"午後-夜間\",(IF(AND(F40=1,F41=2,F42=2),\"午前\",(IF(AND(F40=2,F41=1,F42=2),\"午後\",IF(AND(F40=1,F41=2,F42=1),\"午前・夜間\",\"夜間\"))))))))))","v":"夜間"},null,{"$f":"IF(I39>0,VLOOKUP(O39,$A$235:$B$238,2,FALSE),VLOOKUP(O39,$A$226:$B$232,2,FALSE))","v":"18:00-21:00"},{"$f":"IF(B39=B35,\"\",B39)","v":""},{"$f":"B39","v":"00:00:00"},{"$f":"YEAR(S39)","v":1900},"年",{"$f":"T39&U39&T40&U40","v":"1900年1月"},{"$f":"IF(AND(F40=1,F41=1,F42=1),\"APN\",(IF(AND(F40=1,F41=1,F42=2),\"AP\",(IF(AND(F40=2,F41=1,F42=1),\"PN\",(IF(AND(F40=1,F41=2,F42=2),\"A\",(IF(AND(F40=2,F41=1,F42=2),\"P\",\"N\")))))))))","v":"N"},{"$f":"利用申込書1!$AV$50","v":""},{"$f":"X40&W39&\"・\"&AB39","v":"0N・"},{"$f":"T39&U39","v":"1900年"},{"$f":"Z39&V40","v":"1900年1月0日"},{"$f":"CLEAN(X39)","v":""}]
[null,{"$f":"TEXT(B39,\"YYYY\")","v":"1900"},null,null,"チェック2",{"$f":"IF(F39=1,1,IF(G40,1,2))","v":2},false,null,null,{"$f":"B42&$J$6","v":"0A"},{"$f":"B42&$K$6","v":"0P"},{"$f":"B42&$L$6","v":"0N"},null,null,null,null,{"$f":"LEFT(Q39,2)","v":"18"},null,{"$f":"B39","v":"00:00:00"},{"$f":"MONTH(S39)","v":1},"月",{"$f":"T40&U40&T41&U41","v":"1月0日"},{"$f":"D39","v":0},{"$f":"LEFT(W40,3)","v":"0"}]
[null,{"$f":"TEXT(B39,\"YYYYmm\")","v":"190001"},null,null,"チェック3",2,false,null,null,{"$f":"G40","v":false},{"$f":"G41","v":false},{"$f":"G42","v":false},null,null,null,null,{"$f":"IF(MID(Q39,6,1)=\"-\",MID(Q39,7,2),MID(Q39,6,2))","v":"21"},null,null,{"$f":"DAY(S39)","v":0},"日",{"$f":"T41&U41","v":"0日"}]
[null,{"$f":"TEXT(B39,\"d\")","v":"0"},null,null,"チェック4",2,false,null,null,null,null,null,null,null,null,null,null,null,null,null,null,{"$f":"T40&U40","v":"1月"}]
[{"$f":"IF(D43=\"大会議室(準備)\",\"大会議室\",(IF(D43=\"大会議室(本番)\",\"大会議室\",(IF(D43=\"ピアザホール(準備)\",\"PH\",IF(D43=\"ピアザホール(本番)\",\"PH\",IF(D43=\"練習室(一般)\",\"練習室\",IF(D43=\"練習室(学生)\",\"練習室\",D43))))))))","v":0},{"$f":"IF(利用申込書2!A12=\"\", B39,利用申込書2!A12)","v":"00:00:00"},{"$f":"IF(OR((WEEKDAY(B43,2)>=6),COUNTIF(DATA!$Q$3:$T$23,B43)),2,1)","v":2},{"$f":"利用申込書2!F12","v":0},"チェック1",2,false,{"$f":"IF(AND($C$1=1,$C$2=1,C43=1),1,(IF(AND($C$1=1,$C$2=2,C43=1),2,(IF(AND($C$1=1,$C$2=3,C43=1),3,(IF(AND($C$1=2,$C$2=1,C43=1),4,(IF(AND($C$1=2,$C$2=2,C43=1),5,(IF(AND($C$1=2,$C$2=3,C43=1),6,(IF(AND($C$1=1,$C$2=1,C43=2),7,(IF(AND($C$1=1,$C$2=2,C43=2),8,(IF(AND($C$1=1,$C$2=3,C43=2),9,(IF(AND($C$1=2,$C$2=1,C43=2),10,(IF(AND($C$1=2,$C$2=2,C43=2),11,(IF(AND($C$1=2,$C$2=3,C43=2),12,\"\")))))))))))))))))))))))","v":7},{"$f":"CHOOSE(H43,VLOOKUP(D43,DATA!$B$2:$N$25,2,FALSE),VLOOKUP(D43,DATA!$B$2:$N$25,3,FALSE),VLOOKUP(D43,DATA!$B$2:$N$25,4,FALSE),VLOOKUP(D43,DATA!$B$2:$N$25,5,FALSE),VLOOKUP(D43,DATA!$B$2:$N$25,6,FALSE),VLOOKUP(D43,DATA!$B$2:$N$25,7,FALSE),VLOOKUP(D43,DATA!$B$2:$N$25,8,FALSE),VLOOKUP(D43,DATA!$B$2:$N$25,9,FALSE),VLOOKUP(D43,DATA!$B$2:$N$25,10,FALSE),VLOOKUP(D43,DATA!$B$2:$N$25,11,FALSE),VLOOKUP(D43,DATA!$B$2:$N$25,12,FALSE),VLOOKUP(D43,DATA!$B$2:$N$25,13,FALSE),\"\")*(IF(F43=1,1,0))","v":0},{"$f":"CHOOSE(H43,VLOOKUP(D43,DATA!$B$27:$N$50,2,FALSE),VLOOKUP(D43,DATA!$B$27:$N$50,3,FALSE),VLOOKUP(D43,DATA!$B$27:$N$50,4,FALSE),VLOOKUP(D43,DATA!$B$27:$N$50,5,FALSE),VLOOKUP(D43,DATA!$B$27:$N$50,6,FALSE),VLOOKUP(D43,DATA!$B$27:$N$50,7,FALSE),VLOOKUP(D43,DATA!$B$27:$N$50,8,FALSE),VLOOKUP(D43,DATA!$B$27:$N$50,9,FALSE),VLOOKUP(D43,DATA!$B$27:$N$50,10,FALSE),VLOOKUP(D43,DATA!$B$27:$N$50,11,FALSE),VLOOKUP(D43,DATA!$B$27:$N$50,12,FALSE),VLOOKUP(D43,DATA!$B$27:$N$50,13,FALSE),\"\")*(IF(F44=1,1,0))","v":0},{"$f":"CHOOSE(H43,VLOOKUP(D43,DATA!$B$52:$N$75,2,FALSE),VLOOKUP(D43,DATA!$B$52:$N$75,3,FALSE),VLOOKUP(D43,DATA!$B$52:$N$75,4,FALSE),VLOOKUP(D43,DATA!$B$52:$N$77,5,FALSE),VLOOKUP(D43,DATA!$B$52:$N$75,6,FALSE),VLOOKUP(D43,DATA!$B$52:$N$75,7,FALSE),VLOOKUP(D43,DATA!$B$52:$N$75,8,FALSE),VLOOKUP(D43,DATA!$B$52:$N$75,9,FALSE),VLOOKUP(D43,DATA!$B$52:$N$75,10,FALSE),VLOOKUP(D43,DATA!$B$52:$N$75,11,FALSE),VLOOKUP(D43,DATA!$B$52:$N$75,12,FALSE),VLOOKUP(D43,DATA!$B$52:$N$75,13,FALSE),\"\")*(IF(F45=1,1,0))","v":0},{"$f":"CHOOSE(H43,VLOOKUP(D43,DATA!$B$77:$N$100,2,FALSE),VLOOKUP(D43,DATA!$B$77:$N$100,3,FALSE),VLOOKUP(D43,DATA!$B$77:$N$100,4,FALSE),VLOOKUP(D43,DATA!$B$77:$N$100,5,FALSE),VLOOKUP(D43,DATA!$B$77:$N$100,6,FALSE),VLOOKUP(D43,DATA!$B$77:$N$100,7,FALSE),VLOOKUP(D43,DATA!$B$77:$N$100,8,FALSE),VLOOKUP(D43,DATA!$B$77:$N$100,9,FALSE),VLOOKUP(D43,DATA!$B$77:$N$100,10,FALSE),VLOOKUP(D43,DATA!$B$77:$N$100,11,FALSE),VLOOKUP(D43,DATA!$B$77:$N$100,12,FALSE),VLOOKUP(D43,DATA!$B$77:$N$100,13,FALSE),\"\")*(IF(F46=1,1,0))","v":0},{"$f":"CHOOSE(H43,VLOOKUP(D43,DATA!$B$102:$N$125,2,FALSE),VLOOKUP(D43,DATA!$B$102:$N$125,3,FALSE),VLOOKUP(D43,DATA!$B$102:$N$125,4,FALSE),VLOOKUP(D43,DATA!$B$102:$N$125,5,FALSE),VLOOKUP(D43,DATA!$B$102:$N$125,6,FALSE),VLOOKUP(D43,DATA!$B$102:$N$125,7,FALSE),VLOOKUP(D43,DATA!$B$102:$N$125,8,FALSE),VLOOKUP(D43,DATA!$B$102:$N$125,9,FALSE),VLOOKUP(D43,DATA!$B$102:$N$125,10,FALSE),VLOOKUP(D43,DATA!$B$102:$N$125,11,FALSE),VLOOKUP(D43,DATA!$B$102:$N$125,12,FALSE),VLOOKUP(D43,DATA!$B$102:$N$125,13,FALSE),\"\")*(IF(F46=1,1,0))","v":0},{"$f":"利用申込書2!AG12","v":""},{"$f":"IF(AND(F44=1,F45=1,F46=1),\"午前-午後-夜間\",(IF(AND(F44=1,F45=1,F46=2),\"午前-午後\",(IF(AND(F44=2,F45=1,F46=1),\"午後-夜間\",(IF(AND(F44=1,F45=2,F46=2),\"午前\",(IF(AND(F44=2,F45=1,F46=2),\"午後\",IF(AND(F44=1,F45=2,F46=1),\"午前・夜間\",\"夜間\"))))))))))","v":"夜間"},null,{"$f":"IF(I43>0,VLOOKUP(O43,$A$235:$B$238,2,FALSE),VLOOKUP(O43,$A$226:$B$232,2,FALSE))","v":"18:00-21:00"},{"$f":"IF(B43=B39,\"\",B43)","v":""},{"$f":"B43","v":"00:00:00"},{"$f":"YEAR(S43)","v":1900},"年",{"$f":"T43&U43&T44&U44","v":"1900年1月"},{"$f":"IF(AND(F44=1,F45=1,F46=1),\"APN\",(IF(AND(F44=1,F45=1,F46=2),\"AP\",(IF(AND(F44=2,F45=1,F46=1),\"PN\",(IF(AND(F44=1,F45=2,F46=2),\"A\",(IF(AND(F44=2,F45=1,F46=2),\"P\",\"N\")))))))))","v":"N"},{"$f":"利用申込書1!$AV$50","v":""},{"$f":"X44&W43&\"・\"&AB43","v":"0N・"},{"$f":"T43&U43","v":"1900年"},{"$f":"Z43&V44","v":"1900年1月0日"},{"$f":"CLEAN(X43)","v":""}]
[null,{"$f":"TEXT(B43,\"YYYY\")","v":"1900"},null,null,"チェック2",{"$f":"IF(F43=1,1,IF(G44,1,2))","v":2},false,null,null,{"$f":"B46&$J$6","v":"0A"},{"$f":"B46&$K$6","v":"0P"},{"$f":"B46&$L$6","v":"0N"},null,null,null,null,{"$f":"LEFT(Q43,2)","v":"18"},null,{"$f":"B43","v":"00:00:00"},{"$f":"MONTH(S43)","v":1},"月",{"$f":"T44&U44&T45&U45","v":"1月0日"},{"$f":"D43","v":0},{"$f":"LEFT(W44,3)","v":"0"}]
[null,{"$f":"TEXT(B43,\"YYYYmm\")","v":"190001"},null,null,"チェック3",2,false,null,null,{"$f":"G44","v":false},{"$f":"G45","v":false},{"$f":"G46","v":false},null,null,null,null,{"$f":"IF(MID(Q43,6,1)=\"-\",MID(Q43,7,2),MID(Q43,6,2))","v":"21"},null,null,{"$f":"DAY(S43)","v":0},"日",{"$f":"T45&U45","v":"0日"}]
[null,{"$f":"TEXT(B43,\"d\")","v":"0"},null,null,"チェック4",2,false,null,null,null,null,null,null,null,null,null,null,null,null,null,null,{"$f":"T44&U44","v":"1月"}]
[{"$f":"IF(D47=\"大会議室(準備)\",\"大会議室\",(IF(D47=\"大会議室(本番)\",\"大会議室\",(IF(D47=\"ピアザホール(準備)\",\"PH\",IF(D47=\"ピアザホール(本番)\",\"PH\",IF(D47=\"練習室(一般)\",\"練習室\",IF(D47=\"練習室(学生)\",\"練習室\",D47))))))))","v":0},{"$f":"IF(利用申込書2!A14=\"\", B43,利用申込書2!A14)","v":"00:00:00"},{"$f":"IF(OR((WEEKDAY(B47,2)>=6),COUNTIF(DATA!$Q$3:$T$23,B47)),2,1)","v":2},{"$f":"利用申込書2!F14","v":0},"チェック1",2,false,{"$f":"IF(AND($C$1=1,$C$2=1,C47=1),1,(IF(AND($C$1=1,$C$2=2,C47=1),2,(IF(AND($C$1=1,$C$2=3,C47=1),3,(IF(AND($C$1=2,$C$2=1,C47=1),4,(IF(AND($C$1=2,$C$2=2,C47=1),5,(IF(AND($C$1=2,$C$2=3,C47=1),6,(IF(AND($C$1=1,$C$2=1,C47=2),7,(IF(AND($C$1=1,$C$2=2,C47=2),8,(IF(AND($C$1=1,$C$2=3,C47=2),9,(IF(AND($C$1=2,$C$2=1,C47=2),10,(IF(AND($C$1=2,$C$2=2,C47=2),11,(IF(AND($C$1=2,$C$2=3,C47=2),12,\"\")))))))))))))))))))))))","v":7},{"$f":"CHOOSE(H47,VLOOKUP(D47,DATA!$B$2:$N$25,2,FALSE),VLOOKUP(D47,DATA!$B$2:$N$25,3,FALSE),VLOOKUP(D47,DATA!$B$2:$N$25,4,FALSE),VLOOKUP(D47,DATA!$B$2:$N$25,5,FALSE),VLOOKUP(D47,DATA!$B$2:$N$25,6,FALSE),VLOOKUP(D47,DATA!$B$2:$N$25,7,FALSE),VLOOKUP(D47,DATA!$B$2:$N$25,8,FALSE),VLOOKUP(D47,DATA!$B$2:$N$25,9,FALSE),VLOOKUP(D47,DATA!$B$2:$N$25,10,FALSE),VLOOKUP(D47,DATA!$B$2:$N$25,11,FALSE),VLOOKUP(D47,DATA!$B$2:$N$25,12,FALSE),VLOOKUP(D47,DATA!$B$2:$N$25,13,FALSE),\"\")*(IF(F47=1,1,0))","v":0},{"$f":"CHOOSE(H47,VLOOKUP(D47,DATA!$B$27:$N$50,2,FALSE),VLOOKUP(D47,DATA!$B$27:$N$50,3,FALSE),VLOOKUP(D47,DATA!$B$27:$N$50,4,FALSE),VLOOKUP(D47,DATA!$B$27:$N$50,5,FALSE),VLOOKUP(D47,DATA!$B$27:$N$50,6,FALSE),VLOOKUP(D47,DATA!$B$27:$N$50,7,FALSE),VLOOKUP(D47,DATA!$B$27:$N$50,8,FALSE),VLOOKUP(D47,DATA!$B$27:$N$50,9,FALSE),VLOOKUP(D47,DATA!$B$27:$N$50,10,FALSE),VLOOKUP(D47,DATA!$B$27:$N$50,11,FALSE),VLOOKUP(D47,DATA!$B$27:$N$50,12,FALSE),VLOOKUP(D47,DATA!$B$27:$N$50,13,FALSE),\"\")*(IF(F48=1,1,0))","v":0},{"$f":"CHOOSE(H47,VLOOKUP(D47,DATA!$B$52:$N$75,2,FALSE),VLOOKUP(D47,DATA!$B$52:$N$75,3,FALSE),VLOOKUP(D47,DATA!$B$52:$N$75,4,FALSE),VLOOKUP(D47,DATA!$B$52:$N$77,5,FALSE),VLOOKUP(D47,DATA!$B$52:$N$75,6,FALSE),VLOOKUP(D47,DATA!$B$52:$N$75,7,FALSE),VLOOKUP(D47,DATA!$B$52:$N$75,8,FALSE),VLOOKUP(D47,DATA!$B$52:$N$75,9,FALSE),VLOOKUP(D47,DATA!$B$52:$N$75,10,FALSE),VLOOKUP(D47,DATA!$B$52:$N$75,11,FALSE),VLOOKUP(D47,DATA!$B$52:$N$75,12,FALSE),VLOOKUP(D47,DATA!$B$52:$N$75,13,FALSE),\"\")*(IF(F49=1,1,0))","v":0},{"$f":"CHOOSE(H47,VLOOKUP(D47,DATA!$B$77:$N$100,2,FALSE),VLOOKUP(D47,DATA!$B$77:$N$100,3,FALSE),VLOOKUP(D47,DATA!$B$77:$N$100,4,FALSE),VLOOKUP(D47,DATA!$B$77:$N$100,5,FALSE),VLOOKUP(D47,DATA!$B$77:$N$100,6,FALSE),VLOOKUP(D47,DATA!$B$77:$N$100,7,FALSE),VLOOKUP(D47,DATA!$B$77:$N$100,8,FALSE),VLOOKUP(D47,DATA!$B$77:$N$100,9,FALSE),VLOOKUP(D47,DATA!$B$77:$N$100,10,FALSE),VLOOKUP(D47,DATA!$B$77:$N$100,11,FALSE),VLOOKUP(D47,DATA!$B$77:$N$100,12,FALSE),VLOOKUP(D47,DATA!$B$77:$N$100,13,FALSE),\"\")*(IF(F50=1,1,0))","v":0},{"$f":"CHOOSE(H47,VLOOKUP(D47,DATA!$B$102:$N$125,2,FALSE),VLOOKUP(D47,DATA!$B$102:$N$125,3,FALSE),VLOOKUP(D47,DATA!$B$102:$N$125,4,FALSE),VLOOKUP(D47,DATA!$B$102:$N$125,5,FALSE),VLOOKUP(D47,DATA!$B$102:$N$125,6,FALSE),VLOOKUP(D47,DATA!$B$102:$N$125,7,FALSE),VLOOKUP(D47,DATA!$B$102:$N$125,8,FALSE),VLOOKUP(D47,DATA!$B$102:$N$125,9,FALSE),VLOOKUP(D47,DATA!$B$102:$N$125,10,FALSE),VLOOKUP(D47,DATA!$B$102:$N$125,11,FALSE),VLOOKUP(D47,DATA!$B$102:$N$125,12,FALSE),VLOOKUP(D47,DATA!$B$102:$N$125,13,FALSE),\"\")*(IF(F50=1,1,0))","v":0},{"$f":"利用申込書2!AG14","v":""},{"$f":"IF(AND(F48=1,F49=1,F50=1),\"午前-午後-夜間\",(IF(AND(F48=1,F49=1,F50=2),\"午前-午後\",(IF(AND(F48=2,F49=1,F50=1),\"午後-夜間\",(IF(AND(F48=1,F49=2,F50=2),\"午前\",(IF(AND(F48=2,F49=1,F50=2),\"午後\",IF(AND(F48=1,F49=2,F50=1),\"午前・夜間\",\"夜間\"))))))))))","v":"夜間"},null,{"$f":"IF(I47>0,VLOOKUP(O47,$A$235:$B$238,2,FALSE),VLOOKUP(O47,$A$226:$B$232,2,FALSE))","v":"18:00-21:00"},{"$f":"IF(B47=B43,\"\",B47)","v":""},{"$f":"B47","v":"00:00:00"},{"$f":"YEAR(S47)","v":1900},"年",{"$f":"T47&U47&T48&U48","v":"1900年1月"},{"$f":"IF(AND(F48=1,F49=1,F50=1),\"APN\",(IF(AND(F48=1,F49=1,F50=2),\"AP\",(IF(AND(F48=2,F49=1,F50=1),\"PN\",(IF(AND(F48=1,F49=2,F50=2),\"A\",(IF(AND(F48=2,F49=1,F50=2),\"P\",\"N\")))))))))","v":"N"},{"$f":"利用申込書1!$AV$50","v":""},{"$f":"X48&W47&\"・\"&AB47","v":"0N・"},{"$f":"T47&U47","v":"1900年"},{"$f":"Z47&V48","v":"1900年1月0日"},{"$f":"CLEAN(X47)","v":""}]
[null,{"$f":"TEXT(B47,\"YYYY\")","v":"1900"},null,null,"チェック2",{"$f":"IF(F47=1,1,IF(G48,1,2))","v":2},false,null,null,{"$f":"B50&$J$6","v":"0A"},{"$f":"B50&$K$6","v":"0P"},{"$f":"B50&$L$6","v":"0N"},null,null,null,null,{"$f":"LEFT(Q47,2)","v":"18"},null,{"$f":"B47","v":"00:00:00"},{"$f":"MONTH(S47)","v":1},"月",{"$f":"T48&U48&T49&U49","v":"1月0日"},{"$f":"D47","v":0},{"$f":"LEFT(W48,3)","v":"0"}]
[null,{"$f":"TEXT(B47,\"YYYYmm\")","v":"190001"},null,null,"チェック3",2,false,null,null,{"$f":"G48","v":false},{"$f":"G49","v":false},{"$f":"G50","v":false},null,null,null,null,{"$f":"IF(MID(Q47,6,1)=\"-\",MID(Q47,7,2),MID(Q47,6,2))","v":"21"},null,null,{"$f":"DAY(S47)","v":0},"日",{"$f":"T49&U49","v":"0日"}]
[null,{"$f":"TEXT(B47,\"d\")","v":"0"},null,null,"チェック4",2,false,null,null,null,null,null,null,null,null,null,null,null,null,null,null,{"$f":"T48&U48","v":"1月"}]
[{"$f":"IF(D51=\"大会議室(準備)\",\"大会議室\",(IF(D51=\"大会議室(本番)\",\"大会議室\",(IF(D51=\"ピアザホール(準備)\",\"PH\",IF(D51=\"ピアザホール(本番)\",\"PH\",IF(D51=\"練習室(一般)\",\"練習室\",IF(D51=\"練習室(学生)\",\"練習室\",D51))))))))","v":0},{"$f":"IF(利用申込書2!A16=\"\", B47,利用申込書2!A16)","v":"00:00:00"},{"$f":"IF(OR((WEEKDAY(B51,2)>=6),COUNTIF(DATA!$Q$3:$T$23,B51)),2,1)","v":2},{"$f":"利用申込書2!F16","v":0},"チェック1",2,false,{"$f":"IF(AND($C$1=1,$C$2=1,C51=1),1,(IF(AND($C$1=1,$C$2=2,C51=1),2,(IF(AND($C$1=1,$C$2=3,C51=1),3,(IF(AND($C$1=2,$C$2=1,C51=1),4,(IF(AND($C$1=2,$C$2=2,C51=1),5,(IF(AND($C$1=2,$C$2=3,C51=1),6,(IF(AND($C$1=1,$C$2=1,C51=2),7,(IF(AND($C$1=1,$C$2=2,C51=2),8,(IF(AND($C$1=1,$C$2=3,C51=2),9,(IF(AND($C$1=2,$C$2=1,C51=2),10,(IF(AND($C$1=2,$C$2=2,C51=2),11,(IF(AND($C$1=2,$C$2=3,C51=2),12,\"\")))))))))))))))))))))))","v":7},{"$f":"CHOOSE(H51,VLOOKUP(D51,DATA!$B$2:$N$25,2,FALSE),VLOOKUP(D51,DATA!$B$2:$N$25,3,FALSE),VLOOKUP(D51,DATA!$B$2:$N$25,4,FALSE),VLOOKUP(D51,DATA!$B$2:$N$25,5,FALSE),VLOOKUP(D51,DATA!$B$2:$N$25,6,FALSE),VLOOKUP(D51,DATA!$B$2:$N$25,7,FALSE),VLOOKUP(D51,DATA!$B$2:$N$25,8,FALSE),VLOOKUP(D51,DATA!$B$2:$N$25,9,FALSE),VLOOKUP(D51,DATA!$B$2:$N$25,10,FALSE),VLOOKUP(D51,DATA!$B$2:$N$25,11,FALSE),VLOOKUP(D51,DATA!$B$2:$N$25,12,FALSE),VLOOKUP(D51,DATA!$B$2:$N$25,13,FALSE),\"\")*(IF(F51=1,1,0))","v":0},{"$f":"CHOOSE(H51,VLOOKUP(D51,DATA!$B$27:$N$50,2,FALSE),VLOOKUP(D51,DATA!$B$27:$N$50,3,FALSE),VLOOKUP(D51,DATA!$B$27:$N$50,4,FALSE),VLOOKUP(D51,DATA!$B$27:$N$50,5,FALSE),VLOOKUP(D51,DATA!$B$27:$N$50,6,FALSE),VLOOKUP(D51,DATA!$B$27:$N$50,7,FALSE),VLOOKUP(D51,DATA!$B$27:$N$50,8,FALSE),VLOOKUP(D51,DATA!$B$27:$N$50,9,FALSE),VLOOKUP(D51,DATA!$B$27:$N$50,10,FALSE),VLOOKUP(D51,DATA!$B$27:$N$50,11,FALSE),VLOOKUP(D51,DATA!$B$27:$N$50,12,FALSE),VLOOKUP(D51,DATA!$B$27:$N$50,13,FALSE),\"\")*(IF(F52=1,1,0))","v":0},{"$f":"CHOOSE(H51,VLOOKUP(D51,DATA!$B$52:$N$75,2,FALSE),VLOOKUP(D51,DATA!$B$52:$N$75,3,FALSE),VLOOKUP(D51,DATA!$B$52:$N$75,4,FALSE),VLOOKUP(D51,DATA!$B$52:$N$77,5,FALSE),VLOOKUP(D51,DATA!$B$52:$N$75,6,FALSE),VLOOKUP(D51,DATA!$B$52:$N$75,7,FALSE),VLOOKUP(D51,DATA!$B$52:$N$75,8,FALSE),VLOOKUP(D51,DATA!$B$52:$N$75,9,FALSE),VLOOKUP(D51,DATA!$B$52:$N$75,10,FALSE),VLOOKUP(D51,DATA!$B$52:$N$75,11,FALSE),VLOOKUP(D51,DATA!$B$52:$N$75,12,FALSE),VLOOKUP(D51,DATA!$B$52:$N$75,13,FALSE),\"\")*(IF(F53=1,1,0))","v":0},{"$f":"CHOOSE(H51,VLOOKUP(D51,DATA!$B$77:$N$100,2,FALSE),VLOOKUP(D51,DATA!$B$77:$N$100,3,FALSE),VLOOKUP(D51,DATA!$B$77:$N$100,4,FALSE),VLOOKUP(D51,DATA!$B$77:$N$100,5,FALSE),VLOOKUP(D51,DATA!$B$77:$N$100,6,FALSE),VLOOKUP(D51,DATA!$B$77:$N$100,7,FALSE),VLOOKUP(D51,DATA!$B$77:$N$100,8,FALSE),VLOOKUP(D51,DATA!$B$77:$N$100,9,FALSE),VLOOKUP(D51,DATA!$B$77:$N$100,10,FALSE),VLOOKUP(D51,DATA!$B$77:$N$100,11,FALSE),VLOOKUP(D51,DATA!$B$77:$N$100,12,FALSE),VLOOKUP(D51,DATA!$B$77:$N$100,13,FALSE),\"\")*(IF(F54=1,1,0))","v":0},{"$f":"CHOOSE(H51,VLOOKUP(D51,DATA!$B$102:$N$125,2,FALSE),VLOOKUP(D51,DATA!$B$102:$N$125,3,FALSE),VLOOKUP(D51,DATA!$B$102:$N$125,4,FALSE),VLOOKUP(D51,DATA!$B$102:$N$125,5,FALSE),VLOOKUP(D51,DATA!$B$102:$N$125,6,FALSE),VLOOKUP(D51,DATA!$B$102:$N$125,7,FALSE),VLOOKUP(D51,DATA!$B$102:$N$125,8,FALSE),VLOOKUP(D51,DATA!$B$102:$N$125,9,FALSE),VLOOKUP(D51,DATA!$B$102:$N$125,10,FALSE),VLOOKUP(D51,DATA!$B$102:$N$125,11,FALSE),VLOOKUP(D51,DATA!$B$102:$N$125,12,FALSE),VLOOKUP(D51,DATA!$B$102:$N$125,13,FALSE),\"\")*(IF(F54=1,1,0))","v":0},{"$f":"利用申込書2!AG16","v":""},{"$f":"IF(AND(F52=1,F53=1,F54=1),\"午前-午後-夜間\",(IF(AND(F52=1,F53=1,F54=2),\"午前-午後\",(IF(AND(F52=2,F53=1,F54=1),\"午後-夜間\",(IF(AND(F52=1,F53=2,F54=2),\"午前\",(IF(AND(F52=2,F53=1,F54=2),\"午後\",IF(AND(F52=1,F53=2,F54=1),\"午前・夜間\",\"夜間\"))))))))))","v":"夜間"},null,{"$f":"IF(I51>0,VLOOKUP(O51,$A$235:$B$238,2,FALSE),VLOOKUP(O51,$A$226:$B$232,2,FALSE))","v":"18:00-21:00"},{"$f":"IF(B51=B47,\"\",B51)","v":""},{"$f":"B51","v":"00:00:00"},{"$f":"YEAR(S51)","v":1900},"年",{"$f":"T51&U51&T52&U52","v":"1900年1月"},{"$f":"IF(AND(F52=1,F53=1,F54=1),\"APN\",(IF(AND(F52=1,F53=1,F54=2),\"AP\",(IF(AND(F52=2,F53=1,F54=1),\"PN\",(IF(AND(F52=1,F53=2,F54=2),\"A\",(IF(AND(F52=2,F53=1,F54=2),\"P\",\"N\")))))))))","v":"N"},{"$f":"利用申込書1!$AV$50","v":""},{"$f":"X52&W51&\"・\"&AB51","v":"0N・"},{"$f":"T51&U51","v":"1900年"},{"$f":"Z51&V52","v":"1900年1月0日"},{"$f":"CLEAN(X51)","v":""}]
[null,{"$f":"TEXT(B51,\"YYYY\")","v":"1900"},null,null,"チェック2",{"$f":"IF(F51=1,1,IF(G52,1,2))","v":2},false,null,null,{"$f":"B54&$J$6","v":"0A"},{"$f":"B54&$K$6","v":"0P"},{"$f":"B54&$L$6","v":"0N"},null,null,null,null,{"$f":"LEFT(Q51,2)","v":"18"},null,{"$f":"B51","v":"00:00:00"},{"$f":"MONTH(S51)","v":1},"月",{"$f":"T52&U52&T53&U53","v":"1月0日"},{"$f":"D51","v":0},{"$f":"LEFT(W52,3)","v":"0"}]
[null,{"$f":"TEXT(B51,\"YYYYmm\")","v":"190001"},null,null,"チェック3",2,false,null,null,{"$f":"G52","v":false},{"$f":"G53","v":false},{"$f":"G54","v":false},null,null,null,null,{"$f":"IF(MID(Q51,6,1)=\"-\",MID(Q51,7,2),MID(Q51,6,2))","v":"21"},null,null,{"$f":"DAY(S51)","v":0},"日",{"$f":"T53&U53","v":"0日"}]
[null,{"$f":"TEXT(B51,\"d\")","v":"0"},null,null,"チェック4",2,false,null,null,null,null,null,null,null,null,null,null,null,null,null,null,{"$f":"T52&U52","v":"1月"}]
[{"$f":"IF(D55=\"大会議室(準備)\",\"大会議室\",(IF(D55=\"大会議室(本番)\",\"大会議室\",(IF(D55=\"ピアザホール(準備)\",\"PH\",IF(D55=\"ピアザホール(本番)\",\"PH\",IF(D55=\"練習室(一般)\",\"練習室\",IF(D55=\"練習室(学生)\",\"練習室\",D55))))))))","v":0},{"$f":"IF(利用申込書2!A18=\"\", B51,利用申込書2!A18)","v":"00:00:00"},{"$f":"IF(OR((WEEKDAY(B55,2)>=6),COUNTIF(DATA!$Q$3:$T$23,B55)),2,1)","v":2},{"$f":"利用申込書2!F18","v":0},"チェック1",2,false,{"$f":"IF(AND($C$1=1,$C$2=1,C55=1),1,(IF(AND($C$1=1,$C$2=2,C55=1),2,(IF(AND($C$1=1,$C$2=3,C55=1),3,(IF(AND($C$1=2,$C$2=1,C55=1),4,(IF(AND($C$1=2,$C$2=2,C55=1),5,(IF(AND($C$1=2,$C$2=3,C55=1),6,(IF(AND($C$1=1,$C$2=1,C55=2),7,(IF(AND($C$1=1,$C$2=2,C55=2),8,(IF(AND($C$1=1,$C$2=3,C55=2),9,(IF(AND($C$1=2,$C$2=1,C55=2),10,(IF(AND($C$1=2,$C$2=2,C55=2),11,(IF(AND($C$1=2,$C$2=3,C55=2),12,\"\")))))))))))))))))))))))","v":7},{"$f":"CHOOSE(H55,VLOOKUP(D55,DATA!$B$2:$N$25,2,FALSE),VLOOKUP(D55,DATA!$B$2:$N$25,3,FALSE),VLOOKUP(D55,DATA!$B$2:$N$25,4,FALSE),VLOOKUP(D55,DATA!$B$2:$N$25,5,FALSE),VLOOKUP(D55,DATA!$B$2:$N$25,6,FALSE),VLOOKUP(D55,DATA!$B$2:$N$25,7,FALSE),VLOOKUP(D55,DATA!$B$2:$N$25,8,FALSE),VLOOKUP(D55,DATA!$B$2:$N$25,9,FALSE),VLOOKUP(D55,DATA!$B$2:$N$25,10,FALSE),VLOOKUP(D55,DATA!$B$2:$N$25,11,FALSE),VLOOKUP(D55,DATA!$B$2:$N$25,12,FALSE),VLOOKUP(D55,DATA!$B$2:$N$25,13,FALSE),\"\")*(IF(F55=1,1,0))","v":0},{"$f":"CHOOSE(H55,VLOOKUP(D55,DATA!$B$27:$N$50,2,FALSE),VLOOKUP(D55,DATA!$B$27:$N$50,3,FALSE),VLOOKUP(D55,DATA!$B$27:$N$50,4,FALSE),VLOOKUP(D55,DATA!$B$27:$N$50,5,FALSE),VLOOKUP(D55,DATA!$B$27:$N$50,6,FALSE),VLOOKUP(D55,DATA!$B$27:$N$50,7,FALSE),VLOOKUP(D55,DATA!$B$27:$N$50,8,FALSE),VLOOKUP(D55,DATA!$B$27:$N$50,9,FALSE),VLOOKUP(D55,DATA!$B$27:$N$50,10,FALSE),VLOOKUP(D55,DATA!$B$27:$N$50,11,FALSE),VLOOKUP(D55,DATA!$B$27:$N$50,12,FALSE),VLOOKUP(D55,DATA!$B$27:$N$50,13,FALSE),\"\")*(IF(F56=1,1,0))","v":0},{"$f":"CHOOSE(H55,VLOOKUP(D55,DATA!$B$52:$N$75,2,FALSE),VLOOKUP(D55,DATA!$B$52:$N$75,3,FALSE),VLOOKUP(D55,DATA!$B$52:$N$75,4,FALSE),VLOOKUP(D55,DATA!$B$52:$N$77,5,FALSE),VLOOKUP(D55,DATA!$B$52:$N$75,6,FALSE),VLOOKUP(D55,DATA!$B$52:$N$75,7,FALSE),VLOOKUP(D55,DATA!$B$52:$N$75,8,FALSE),VLOOKUP(D55,DATA!$B$52:$N$75,9,FALSE),VLOOKUP(D55,DATA!$B$52:$N$75,10,FALSE),VLOOKUP(D55,DATA!$B$52:$N$75,11,FALSE),VLOOKUP(D55,DATA!$B$52:$N$75,12,FALSE),VLOOKUP(D55,DATA!$B$52:$N$75,13,FALSE),\"\")*(IF(F57=1,1,0))","v":0},{"$f":"CHOOSE(H55,VLOOKUP(D55,DATA!$B$77:$N$100,2,FALSE),VLOOKUP(D55,DATA!$B$77:$N$100,3,FALSE),VLOOKUP(D55,DATA!$B$77:$N$100,4,FALSE),VLOOKUP(D55,DATA!$B$77:$N$100,5,FALSE),VLOOKUP(D55,DATA!$B$77:$N$100,6,FALSE),VLOOKUP(D55,DATA!$B$77:$N$100,7,FALSE),VLOOKUP(D55,DATA!$B$77:$N$100,8,FALSE),VLOOKUP(D55,DATA!$B$77:$N$100,9,FALSE),VLOOKUP(D55,DATA!$B$77:$N$100,10,FALSE),VLOOKUP(D55,DATA!$B$77:$N$100,11,FALSE),VLOOKUP(D55,DATA!$B$77:$N$100,12,FALSE),VLOOKUP(D55,DATA!$B$77:$N$100,13,FALSE),\"\")*(IF(F58=1,1,0))","v":0},{"$f":"CHOOSE(H55,VLOOKUP(D55,DATA!$B$102:$N$125,2,FALSE),VLOOKUP(D55,DATA!$B$102:$N$125,3,FALSE),VLOOKUP(D55,DATA!$B$102:$N$125,4,FALSE),VLOOKUP(D55,DATA!$B$102:$N$125,5,FALSE),VLOOKUP(D55,DATA!$B$102:$N$125,6,FALSE),VLOOKUP(D55,DATA!$B$102:$N$125,7,FALSE),VLOOKUP(D55,DATA!$B$102:$N$125,8,FALSE),VLOOKUP(D55,DATA!$B$102:$N$125,9,FALSE),VLOOKUP(D55,DATA!$B$102:$N$125,10,FALSE),VLOOKUP(D55,DATA!$B$102:$N$125,11,FALSE),VLOOKUP(D55,DATA!$B$102:$N$125,12,FALSE),VLOOKUP(D55,DATA!$B$102:$N$125,13,FALSE),\"\")*(IF(F58=1,1,0))","v":0},{"$f":"利用申込書2!AG18","v":""},{"$f":"IF(AND(F56=1,F57=1,F58=1),\"午前-午後-夜間\",(IF(AND(F56=1,F57=1,F58=2),\"午前-午後\",(IF(AND(F56=2,F57=1,F58=1),\"午後-夜間\",(IF(AND(F56=1,F57=2,F58=2),\"午前\",(IF(AND(F56=2,F57=1,F58=2),\"午後\",IF(AND(F56=1,F57=2,F58=1),\"午前・夜間\",\"夜間\"))))))))))","v":"夜間"},null,{"$f":"IF(I55>0,VLOOKUP(O55,$A$235:$B$238,2,FALSE),VLOOKUP(O55,$A$226:$B$232,2,FALSE))","v":"18:00-21:00"},{"$f":"IF(B55=B51,\"\",B55)","v":""},{"$f":"B55","v":"00:00:00"},{"$f":"YEAR(S55)","v":1900},"年",{"$f":"T55&U55&T56&U56","v":"1900年1月"},{"$f":"IF(AND(F56=1,F57=1,F58=1),\"APN\",(IF(AND(F56=1,F57=1,F58=2),\"AP\",(IF(AND(F56=2,F57=1,F58=1),\"PN\",(IF(AND(F56=1,F57=2,F58=2),\"A\",(IF(AND(F56=2,F57=1,F58=2),\"P\",\"N\")))))))))","v":"N"},{"$f":"利用申込書1!$AV$50","v":""},{"$f":"X56&W55&\"・\"&AB55","v":"0N・"},{"$f":"T55&U55","v":"1900年"},{"$f":"Z55&V56","v":"1900年1月0日"},{"$f":"CLEAN(X55)","v":""}]
[null,{"$f":"TEXT(B55,\"YYYY\")","v":"1900"},null,null,"チェック2",{"$f":"IF(F55=1,1,IF(G56,1,2))","v":2},false,null,null,{"$f":"B58&$J$6","v":"0A"},{"$f":"B58&$K$6","v":"0P"},{"$f":"B58&$L$6","v":"0N"},null,null,null,null,{"$f":"LEFT(Q55,2)","v":"18"},null,{"$f":"B55","v":"00:00:00"},{"$f":"MONTH(S55)","v":1},"月",{"$f":"T56&U56&T57&U57","v":"1月0日"},{"$f":"D55","v":0},{"$f":"LEFT(W56,3)","v":"0"}]
[null,{"$f":"TEXT(B55,\"YYYYmm\")","v":"190001"},null,null,"チェック3",2,false,null,null,{"$f":"G56","v":false},{"$f":"G57","v":false},{"$f":"G58","v":false},null,null,null,null,{"$f":"IF(MID(Q55,6,1)=\"-\",MID(Q55,7,2),MID(Q55,6,2))","v":"21"},null,null,{"$f":"DAY(S55)","v":0},"日",{"$f":"T57&U57","v":"0日"}]
[null,{"$f":"TEXT(B55,\"d\")","v":"0"},null,null,"チェック4",2,false,null,null,null,null,null,null,null,null,null,null,null,null,null,null,{"$f":"T56&U56","v":"1月"}]
[{"$f":"IF(D59=\"大会議室(準備)\",\"大会議室\",(IF(D59=\"大会議室(本番)\",\"大会議室\",(IF(D59=\"ピアザホール(準備)\",\"PH\",IF(D59=\"ピアザホール(本番)\",\"PH\",IF(D59=\"練習室(一般)\",\"練習室\",IF(D59=\"練習室(学生)\",\"練習室\",D59))))))))","v":0},{"$f":"IF(利用申込書2!A20=\"\", B55,利用申込書2!A20)","v":"00:00:00"},{"$f":"IF(OR((WEEKDAY(B59,2)>=6),COUNTIF(DATA!$Q$3:$T$23,B59)),2,1)","v":2},{"$f":"利用申込書2!F20","v":0},"チェック1",2,false,{"$f":"IF(AND($C$1=1,$C$2=1,C59=1),1,(IF(AND($C$1=1,$C$2=2,C59=1),2,(IF(AND($C$1=1,$C$2=3,C59=1),3,(IF(AND($C$1=2,$C$2=1,C59=1),4,(IF(AND($C$1=2,$C$2=2,C59=1),5,(IF(AND($C$1=2,$C$2=3,C59=1),6,(IF(AND($C$1=1,$C$2=1,C59=2),7,(IF(AND($C$1=1,$C$2=2,C59=2),8,(IF(AND($C$1=1,$C$2=3,C59=2),9,(IF(AND($C$1=2,$C$2=1,C59=2),10,(IF(AND($C$1=2,$C$2=2,C59=2),11,(IF(AND($C$1=2,$C$2=3,C59=2),12,\"\")))))))))))))))))))))))","v":7},{"$f":"CHOOSE(H59,VLOOKUP(D59,DATA!$B$2:$N$25,2,FALSE),VLOOKUP(D59,DATA!$B$2:$N$25,3,FALSE),VLOOKUP(D59,DATA!$B$2:$N$25,4,FALSE),VLOOKUP(D59,DATA!$B$2:$N$25,5,FALSE),VLOOKUP(D59,DATA!$B$2:$N$25,6,FALSE),VLOOKUP(D59,DATA!$B$2:$N$25,7,FALSE),VLOOKUP(D59,DATA!$B$2:$N$25,8,FALSE),VLOOKUP(D59,DATA!$B$2:$N$25,9,FALSE),VLOOKUP(D59,DATA!$B$2:$N$25,10,FALSE),VLOOKUP(D59,DATA!$B$2:$N$25,11,FALSE),VLOOKUP(D59,DATA!$B$2:$N$25,12,FALSE),VLOOKUP(D59,DATA!$B$2:$N$25,13,FALSE),\"\")*(IF(F59=1,1,0))","v":0},{"$f":"CHOOSE(H59,VLOOKUP(D59,DATA!$B$27:$N$50,2,FALSE),VLOOKUP(D59,DATA!$B$27:$N$50,3,FALSE),VLOOKUP(D59,DATA!$B$27:$N$50,4,FALSE),VLOOKUP(D59,DATA!$B$27:$N$50,5,FALSE),VLOOKUP(D59,DATA!$B$27:$N$50,6,FALSE),VLOOKUP(D59,DATA!$B$27:$N$50,7,FALSE),VLOOKUP(D59,DATA!$B$27:$N$50,8,FALSE),VLOOKUP(D59,DATA!$B$27:$N$50,9,FALSE),VLOOKUP(D59,DATA!$B$27:$N$50,10,FALSE),VLOOKUP(D59,DATA!$B$27:$N$50,11,FALSE),VLOOKUP(D59,DATA!$B$27:$N$50,12,FALSE),VLOOKUP(D59,DATA!$B$27:$N$50,13,FALSE),\"\")*(IF(F60=1,1,0))","v":0},{"$f":"CHOOSE(H59,VLOOKUP(D59,DATA!$B$52:$N$75,2,FALSE),VLOOKUP(D59,DATA!$B$52:$N$75,3,FALSE),VLOOKUP(D59,DATA!$B$52:$N$75,4,FALSE),VLOOKUP(D59,DATA!$B$52:$N$77,5,FALSE),VLOOKUP(D59,DATA!$B$52:$N$75,6,FALSE),VLOOKUP(D59,DATA!$B$52:$N$75,7,FALSE),VLOOKUP(D59,DATA!$B$52:$N$75,8,FALSE),VLOOKUP(D59,DATA!$B$52:$N$75,9,FALSE),VLOOKUP(D59,DATA!$B$52:$N$75,10,FALSE),VLOOKUP(D59,DATA!$B$52:$N$75,11,FALSE),VLOOKUP(D59,DATA!$B$52:$N$75,12,FALSE),VLOOKUP(D59,DATA!$B$52:$N$75,13,FALSE),\"\")*(IF(F61=1,1,0))","v":0},{"$f":"CHOOSE(H59,VLOOKUP(D59,DATA!$B$77:$N$100,2,FALSE),VLOOKUP(D59,DATA!$B$77:$N$100,3,FALSE),VLOOKUP(D59,DATA!$B$77:$N$100,4,FALSE),VLOOKUP(D59,DATA!$B$77:$N$100,5,FALSE),VLOOKUP(D59,DATA!$B$77:$N$100,6,FALSE),VLOOKUP(D59,DATA!$B$77:$N$100,7,FALSE),VLOOKUP(D59,DATA!$B$77:$N$100,8,FALSE),VLOOKUP(D59,DATA!$B$77:$N$100,9,FALSE),VLOOKUP(D59,DATA!$B$77:$N$100,10,FALSE),VLOOKUP(D59,DATA!$B$77:$N$100,11,FALSE),VLOOKUP(D59,DATA!$B$77:$N$100,12,FALSE),VLOOKUP(D59,DATA!$B$77:$N$100,13,FALSE),\"\")*(IF(F62=1,1,0))","v":0},{"$f":"CHOOSE(H59,VLOOKUP(D59,DATA!$B$102:$N$125,2,FALSE),VLOOKUP(D59,DATA!$B$102:$N$125,3,FALSE),VLOOKUP(D59,DATA!$B$102:$N$125,4,FALSE),VLOOKUP(D59,DATA!$B$102:$N$125,5,FALSE),VLOOKUP(D59,DATA!$B$102:$N$125,6,FALSE),VLOOKUP(D59,DATA!$B$102:$N$125,7,FALSE),VLOOKUP(D59,DATA!$B$102:$N$125,8,FALSE),VLOOKUP(D59,DATA!$B$102:$N$125,9,FALSE),VLOOKUP(D59,DATA!$B$102:$N$125,10,FALSE),VLOOKUP(D59,DATA!$B$102:$N$125,11,FALSE),VLOOKUP(D59,DATA!$B$102:$N$125,12,FALSE),VLOOKUP(D59,DATA!$B$102:$N$125,13,FALSE),\"\")*(IF(F62=1,1,0))","v":0},{"$f":"利用申込書2!AG20","v":""},{"$f":"IF(AND(F60=1,F61=1,F62=1),\"午前-午後-夜間\",(IF(AND(F60=1,F61=1,F62=2),\"午前-午後\",(IF(AND(F60=2,F61=1,F62=1),\"午後-夜間\",(IF(AND(F60=1,F61=2,F62=2),\"午前\",(IF(AND(F60=2,F61=1,F62=2),\"午後\",IF(AND(F60=1,F61=2,F62=1),\"午前・夜間\",\"夜間\"))))))))))","v":"夜間"},null,{"$f":"IF(I59>0,VLOOKUP(O59,$A$235:$B$238,2,FALSE),VLOOKUP(O59,$A$226:$B$232,2,FALSE))","v":"18:00-21:00"},{"$f":"IF(B59=B55,\"\",B59)","v":""},{"$f":"B59","v":"00:00:00"},{"$f":"YEAR(S59)","v":1900},"年",{"$f":"T59&U59&T60&U60","v":"1900年1月"},{"$f":"IF(AND(F60=1,F61=1,F62=1),\"APN\",(IF(AND(F60=1,F61=1,F62=2),\"AP\",(IF(AND(F60=2,F61=1,F62=1),\"PN\",(IF(AND(F60=1,F61=2,F62=2),\"A\",(IF(AND(F60=2,F61=1,F62=2),\"P\",\"N\")))))))))","v":"N"},{"$f":"利用申込書1!$AV$50","v":""},{"$f":"X60&W59&\"・\"&AB59","v":"0N・"},{"$f":"T59&U59","v":"1900年"},{"$f":"Z59&V60","v":"1900年1月0日"},{"$f":"CLEAN(X59)","v":""}]
[null,{"$f":"TEXT(B59,\"YYYY\")","v":"1900"},null,null,"チェック2",{"$f":"IF(F59=1,1,IF(G60,1,2))","v":2},false,null,null,{"$f":"B62&$J$6","v":"0A"},{"$f":"B62&$K$6","v":"0P"},{"$f":"B62&$L$6","v":"0N"},null,null,null,null,{"$f":"LEFT(Q59,2)","v":"18"},null,{"$f":"B59","v":"00:00:00"},{"$f":"MONTH(S59)","v":1},"月",{"$f":"T60&U60&T61&U61","v":"1月0日"},{"$f":"D59","v":0},{"$f":"LEFT(W60,3)","v":"0"}]
[null,{"$f":"TEXT(B59,\"YYYYmm\")","v":"190001"},null,null,"チェック3",2,false,null,null,{"$f":"G60","v":false},{"$f":"G61","v":false},{"$f":"G62","v":false},null,null,null,null,{"$f":"IF(MID(Q59,6,1)=\"-\",MID(Q59,7,2),MID(Q59,6,2))","v":"21"},null,null,{"$f":"DAY(S59)","v":0},"日",{"$f":"T61&U61","v":"0日"}]
[null,{"$f":"TEXT(B59,\"d\")","v":"0"},null,null,"チェック4",2,false,null,null,null,null,null,null,null,null,null,null,null,null,null,null,{"$f":"T60&U60","v":"1月"}]
[{"$f":"IF(D63=\"大会議室(準備)\",\"大会議室\",(IF(D63=\"大会議室(本番)\",\"大会議室\",(IF(D63=\"ピアザホール(準備)\",\"PH\",IF(D63=\"ピアザホール(本番)\",\"PH\",IF(D63=\"練習室(一般)\",\"練習室\",IF(D63=\"練習室(学生)\",\"練習室\",D63))))))))","v":0},{"$f":"IF(利用申込書2!A22=\"\", B59,利用申込書2!A22)","v":"00:00:00"},{"$f":"IF(OR((WEEKDAY(B63,2)>=6),COUNTIF(DATA!$Q$3:$T$23,B63)),2,1)","v":2},{"$f":"利用申込書2!F22","v":0},"チェック1",2,false,{"$f":"IF(AND($C$1=1,$C$2=1,C63=1),1,(IF(AND($C$1=1,$C$2=2,C63=1),2,(IF(AND($C$1=1,$C$2=3,C63=1),3,(IF(AND($C$1=2,$C$2=1,C63=1),4,(IF(AND($C$1=2,$C$2=2,C63=1),5,(IF(AND($C$1=2,$C$2=3,C63=1),6,(IF(AND($C$1=1,$C$2=1,C63=2),7,(IF(AND($C$1=1,$C$2=2,C63=2),8,(IF(AND($C$1=1,$C$2=3,C63=2),9,(IF(AND($C$1=2,$C$2=1,C63=2),10,(IF(AND($C$1=2,$C$2=2,C63=2),11,(IF(AND($C$1=2,$C$2=3,C63=2),12,\"\")))))))))))))))))))))))","v":7},{"$f":"CHOOSE(H63,VLOOKUP(D63,DATA!$B$2:$N$25,2,FALSE),VLOOKUP(D63,DATA!$B$2:$N$25,3,FALSE),VLOOKUP(D63,DATA!$B$2:$N$25,4,FALSE),VLOOKUP(D63,DATA!$B$2:$N$25,5,FALSE),VLOOKUP(D63,DATA!$B$2:$N$25,6,FALSE),VLOOKUP(D63,DATA!$B$2:$N$25,7,FALSE),VLOOKUP(D63,DATA!$B$2:$N$25,8,FALSE),VLOOKUP(D63,DATA!$B$2:$N$25,9,FALSE),VLOOKUP(D63,DATA!$B$2:$N$25,10,FALSE),VLOOKUP(D63,DATA!$B$2:$N$25,11,FALSE),VLOOKUP(D63,DATA!$B$2:$N$25,12,FALSE),VLOOKUP(D63,DATA!$B$2:$N$25,13,FALSE),\"\")*(IF(F63=1,1,0))","v":0},{"$f":"CHOOSE(H63,VLOOKUP(D63,DATA!$B$27:$N$50,2,FALSE),VLOOKUP(D63,DATA!$B$27:$N$50,3,FALSE),VLOOKUP(D63,DATA!$B$27:$N$50,4,FALSE),VLOOKUP(D63,DATA!$B$27:$N$50,5,FALSE),VLOOKUP(D63,DATA!$B$27:$N$50,6,FALSE),VLOOKUP(D63,DATA!$B$27:$N$50,7,FALSE),VLOOKUP(D63,DATA!$B$27:$N$50,8,FALSE),VLOOKUP(D63,DATA!$B$27:$N$50,9,FALSE),VLOOKUP(D63,DATA!$B$27:$N$50,10,FALSE),VLOOKUP(D63,DATA!$B$27:$N$50,11,FALSE),VLOOKUP(D63,DATA!$B$27:$N$50,12,FALSE),VLOOKUP(D63,DATA!$B$27:$N$50,13,FALSE),\"\")*(IF(F64=1,1,0))","v":0},{"$f":"CHOOSE(H63,VLOOKUP(D63,DATA!$B$52:$N$75,2,FALSE),VLOOKUP(D63,DATA!$B$52:$N$75,3,FALSE),VLOOKUP(D63,DATA!$B$52:$N$75,4,FALSE),VLOOKUP(D63,DATA!$B$52:$N$77,5,FALSE),VLOOKUP(D63,DATA!$B$52:$N$75,6,FALSE),VLOOKUP(D63,DATA!$B$52:$N$75,7,FALSE),VLOOKUP(D63,DATA!$B$52:$N$75,8,FALSE),VLOOKUP(D63,DATA!$B$52:$N$75,9,FALSE),VLOOKUP(D63,DATA!$B$52:$N$75,10,FALSE),VLOOKUP(D63,DATA!$B$52:$N$75,11,FALSE),VLOOKUP(D63,DATA!$B$52:$N$75,12,FALSE),VLOOKUP(D63,DATA!$B$52:$N$75,13,FALSE),\"\")*(IF(F65=1,1,0))","v":0},{"$f":"CHOOSE(H63,VLOOKUP(D63,DATA!$B$77:$N$100,2,FALSE),VLOOKUP(D63,DATA!$B$77:$N$100,3,FALSE),VLOOKUP(D63,DATA!$B$77:$N$100,4,FALSE),VLOOKUP(D63,DATA!$B$77:$N$100,5,FALSE),VLOOKUP(D63,DATA!$B$77:$N$100,6,FALSE),VLOOKUP(D63,DATA!$B$77:$N$100,7,FALSE),VLOOKUP(D63,DATA!$B$77:$N$100,8,FALSE),VLOOKUP(D63,DATA!$B$77:$N$100,9,FALSE),VLOOKUP(D63,DATA!$B$77:$N$100,10,FALSE),VLOOKUP(D63,DATA!$B$77:$N$100,11,FALSE),VLOOKUP(D63,DATA!$B$77:$N$100,12,FALSE),VLOOKUP(D63,DATA!$B$77:$N$100,13,FALSE),\"\")*(IF(F66=1,1,0))","v":0},{"$f":"CHOOSE(H63,VLOOKUP(D63,DATA!$B$102:$N$125,2,FALSE),VLOOKUP(D63,DATA!$B$102:$N$125,3,FALSE),VLOOKUP(D63,DATA!$B$102:$N$125,4,FALSE),VLOOKUP(D63,DATA!$B$102:$N$125,5,FALSE),VLOOKUP(D63,DATA!$B$102:$N$125,6,FALSE),VLOOKUP(D63,DATA!$B$102:$N$125,7,FALSE),VLOOKUP(D63,DATA!$B$102:$N$125,8,FALSE),VLOOKUP(D63,DATA!$B$102:$N$125,9,FALSE),VLOOKUP(D63,DATA!$B$102:$N$125,10,FALSE),VLOOKUP(D63,DATA!$B$102:$N$125,11,FALSE),VLOOKUP(D63,DATA!$B$102:$N$125,12,FALSE),VLOOKUP(D63,DATA!$B$102:$N$125,13,FALSE),\"\")*(IF(F66=1,1,0))","v":0},{"$f":"利用申込書2!AG22","v":""},{"$f":"IF(AND(F64=1,F65=1,F66=1),\"午前-午後-夜間\",(IF(AND(F64=1,F65=1,F66=2),\"午前-午後\",(IF(AND(F64=2,F65=1,F66=1),\"午後-夜間\",(IF(AND(F64=1,F65=2,F66=2),\"午前\",(IF(AND(F64=2,F65=1,F66=2),\"午後\",IF(AND(F64=1,F65=2,F66=1),\"午前・夜間\",\"夜間\"))))))))))","v":"夜間"},null,{"$f":"IF(I63>0,VLOOKUP(O63,$A$235:$B$238,2,FALSE),VLOOKUP(O63,$A$226:$B$232,2,FALSE))","v":"18:00-21:00"},{"$f":"IF(B63=B59,\"\",B63)","v":""},{"$f":"B63","v":"00:00:00"},{"$f":"YEAR(S63)","v":1900},"年",{"$f":"T63&U63&T64&U64","v":"1900年1月"},{"$f":"IF(AND(F64=1,F65=1,F66=1),\"APN\",(IF(AND(F64=1,F65=1,F66=2),\"AP\",(IF(AND(F64=2,F65=1,F66=1),\"PN\",(IF(AND(F64=1,F65=2,F66=2),\"A\",(IF(AND(F64=2,F65=1,F66=2),\"P\",\"N\")))))))))","v":"N"},{"$f":"利用申込書1!$AV$50","v":""},{"$f":"X64&W63&\"・\"&AB63","v":"0N・"},{"$f":"T63&U63","v":"1900年"},{"$f":"Z63&V64","v":"1900年1月0日"},{"$f":"CLEAN(X63)","v":""}]
[null,{"$f":"TEXT(B63,\"YYYY\")","v":"1900"},null,null,"チェック2",{"$f":"IF(F63=1,1,IF(G64,1,2))","v":2},false,null,null,{"$f":"B66&$J$6","v":"0A"},{"$f":"B66&$K$6","v":"0P"},{"$f":"B66&$L$6","v":"0N"},null,null,null,null,{"$f":"LEFT(Q63,2)","v":"18"},null,{"$f":"B63","v":"00:00:00"},{"$f":"MONTH(S63)","v":1},"月",{"$f":"T64&U64&T65&U65","v":"1月0日"},{"$f":"D63","v":0},{"$f":"LEFT(W64,3)","v":"0"}]
[null,{"$f":"TEXT(B63,\"YYYYmm\")","v":"190001"},null,null,"チェック3",2,false,null,null,{"$f":"G64","v":false},{"$f":"G65","v":false},{"$f":"G66","v":false},null,null,null,null,{"$f":"IF(MID(Q63,6,1)=\"-\",MID(Q63,7,2),MID(Q63,6,2))","v":"21"},null,null,{"$f":"DAY(S63)","v":0},"日",{"$f":"T65&U65","v":"0日"}]
[null,{"$f":"TEXT(B63,\"d\")","v":"0"},null,null,"チェック4",2,false,null,null,null,null,null,null,null,null,null,null,null,null,null,null,{"$f":"T64&U64","v":"1月"}]
[{"$f":"IF(D67=\"大会議室(準備)\",\"大会議室\",(IF(D67=\"大会議室(本番)\",\"大会議室\",(IF(D67=\"ピアザホール(準備)\",\"PH\",IF(D67=\"ピアザホール(本番)\",\"PH\",IF(D67=\"練習室(一般)\",\"練習室\",IF(D67=\"練習室(学生)\",\"練習室\",D67))))))))","v":0},{"$f":"IF(利用申込書2!A24=\"\",B63,利用申込書2!A24)","v":"00:00:00"},{"$f":"IF(OR((WEEKDAY(B67,2)>=6),COUNTIF(DATA!$Q$3:$T$23,B67)),2,1)","v":2},{"$f":"利用申込書2!F24","v":0},"チェック1",2,false,{"$f":"IF(AND($C$1=1,$C$2=1,C67=1),1,(IF(AND($C$1=1,$C$2=2,C67=1),2,(IF(AND($C$1=1,$C$2=3,C67=1),3,(IF(AND($C$1=2,$C$2=1,C67=1),4,(IF(AND($C$1=2,$C$2=2,C67=1),5,(IF(AND($C$1=2,$C$2=3,C67=1),6,(IF(AND($C$1=1,$C$2=1,C67=2),7,(IF(AND($C$1=1,$C$2=2,C67=2),8,(IF(AND($C$1=1,$C$2=3,C67=2),9,(IF(AND($C$1=2,$C$2=1,C67=2),10,(IF(AND($C$1=2,$C$2=2,C67=2),11,(IF(AND($C$1=2,$C$2=3,C67=2),12,\"\")))))))))))))))))))))))","v":7},{"$f":"CHOOSE(H67,VLOOKUP(D67,DATA!$B$2:$N$25,2,FALSE),VLOOKUP(D67,DATA!$B$2:$N$25,3,FALSE),VLOOKUP(D67,DATA!$B$2:$N$25,4,FALSE),VLOOKUP(D67,DATA!$B$2:$N$25,5,FALSE),VLOOKUP(D67,DATA!$B$2:$N$25,6,FALSE),VLOOKUP(D67,DATA!$B$2:$N$25,7,FALSE),VLOOKUP(D67,DATA!$B$2:$N$25,8,FALSE),VLOOKUP(D67,DATA!$B$2:$N$25,9,FALSE),VLOOKUP(D67,DATA!$B$2:$N$25,10,FALSE),VLOOKUP(D67,DATA!$B$2:$N$25,11,FALSE),VLOOKUP(D67,DATA!$B$2:$N$25,12,FALSE),VLOOKUP(D67,DATA!$B$2:$N$25,13,FALSE),\"\")*(IF(F67=1,1,0))","v":0},{"$f":"CHOOSE(H67,VLOOKUP(D67,DATA!$B$27:$N$50,2,FALSE),VLOOKUP(D67,DATA!$B$27:$N$50,3,FALSE),VLOOKUP(D67,DATA!$B$27:$N$50,4,FALSE),VLOOKUP(D67,DATA!$B$27:$N$50,5,FALSE),VLOOKUP(D67,DATA!$B$27:$N$50,6,FALSE),VLOOKUP(D67,DATA!$B$27:$N$50,7,FALSE),VLOOKUP(D67,DATA!$B$27:$N$50,8,FALSE),VLOOKUP(D67,DATA!$B$27:$N$50,9,FALSE),VLOOKUP(D67,DATA!$B$27:$N$50,10,FALSE),VLOOKUP(D67,DATA!$B$27:$N$50,11,FALSE),VLOOKUP(D67,DATA!$B$27:$N$50,12,FALSE),VLOOKUP(D67,DATA!$B$27:$N$50,13,FALSE),\"\")*(IF(F68=1,1,0))","v":0},{"$f":"CHOOSE(H67,VLOOKUP(D67,DATA!$B$52:$N$75,2,FALSE),VLOOKUP(D67,DATA!$B$52:$N$75,3,FALSE),VLOOKUP(D67,DATA!$B$52:$N$75,4,FALSE),VLOOKUP(D67,DATA!$B$52:$N$77,5,FALSE),VLOOKUP(D67,DATA!$B$52:$N$75,6,FALSE),VLOOKUP(D67,DATA!$B$52:$N$75,7,FALSE),VLOOKUP(D67,DATA!$B$52:$N$75,8,FALSE),VLOOKUP(D67,DATA!$B$52:$N$75,9,FALSE),VLOOKUP(D67,DATA!$B$52:$N$75,10,FALSE),VLOOKUP(D67,DATA!$B$52:$N$75,11,FALSE),VLOOKUP(D67,DATA!$B$52:$N$75,12,FALSE),VLOOKUP(D67,DATA!$B$52:$N$75,13,FALSE),\"\")*(IF(F69=1,1,0))","v":0},{"$f":"CHOOSE(H67,VLOOKUP(D67,DATA!$B$77:$N$100,2,FALSE),VLOOKUP(D67,DATA!$B$77:$N$100,3,FALSE),VLOOKUP(D67,DATA!$B$77:$N$100,4,FALSE),VLOOKUP(D67,DATA!$B$77:$N$100,5,FALSE),VLOOKUP(D67,DATA!$B$77:$N$100,6,FALSE),VLOOKUP(D67,DATA!$B$77:$N$100,7,FALSE),VLOOKUP(D67,DATA!$B$77:$N$100,8,FALSE),VLOOKUP(D67,DATA!$B$77:$N$100,9,FALSE),VLOOKUP(D67,DATA!$B$77:$N$100,10,FALSE),VLOOKUP(D67,DATA!$B$77:$N$100,11,FALSE),VLOOKUP(D67,DATA!$B$77:$N$100,12,FALSE),VLOOKUP(D67,DATA!$B$77:$N$100,13,FALSE),\"\")*(IF(F70=1,1,0))","v":0},{"$f":"CHOOSE(H67,VLOOKUP(D67,DATA!$B$102:$N$125,2,FALSE),VLOOKUP(D67,DATA!$B$102:$N$125,3,FALSE),VLOOKUP(D67,DATA!$B$102:$N$125,4,FALSE),VLOOKUP(D67,DATA!$B$102:$N$125,5,FALSE),VLOOKUP(D67,DATA!$B$102:$N$125,6,FALSE),VLOOKUP(D67,DATA!$B$102:$N$125,7,FALSE),VLOOKUP(D67,DATA!$B$102:$N$125,8,FALSE),VLOOKUP(D67,DATA!$B$102:$N$125,9,FALSE),VLOOKUP(D67,DATA!$B$102:$N$125,10,FALSE),VLOOKUP(D67,DATA!$B$102:$N$125,11,FALSE),VLOOKUP(D67,DATA!$B$102:$N$125,12,FALSE),VLOOKUP(D67,DATA!$B$102:$N$125,13,FALSE),\"\")*(IF(F70=1,1,0))","v":0},{"$f":"利用申込書2!AG24","v":""},{"$f":"IF(AND(F68=1,F69=1,F70=1),\"午前-午後-夜間\",(IF(AND(F68=1,F69=1,F70=2),\"午前-午後\",(IF(AND(F68=2,F69=1,F70=1),\"午後-夜間\",(IF(AND(F68=1,F69=2,F70=2),\"午前\",(IF(AND(F68=2,F69=1,F70=2),\"午後\",IF(AND(F68=1,F69=2,F70=1),\"午前・夜間\",\"夜間\"))))))))))","v":"夜間"},null,{"$f":"IF(I67>0,VLOOKUP(O67,$A$235:$B$238,2,FALSE),VLOOKUP(O67,$A$226:$B$232,2,FALSE))","v":"18:00-21:00"},{"$f":"IF(B67=B63,\"\",B67)","v":""},{"$f":"B67","v":"00:00:00"},{"$f":"YEAR(S67)","v":1900},"年",{"$f":"T67&U67&T68&U68","v":"1900年1月"},{"$f":"IF(AND(F68=1,F69=1,F70=1),\"APN\",(IF(AND(F68=1,F69=1,F70=2),\"AP\",(IF(AND(F68=2,F69=1,F70=1),\"PN\",(IF(AND(F68=1,F69=2,F70=2),\"A\",(IF(AND(F68=2,F69=1,F70=2),\"P\",\"N\")))))))))","v":"N"},{"$f":"利用申込書1!$AV$50","v":""},{"$f":"X68&W67&\"・\"&AB67","v":"0N・"},{"$f":"T67&U67","v":"1900年"},{"$f":"Z67&V68","v":"1900年1月0日"},{"$f":"CLEAN(X67)","v":""}]
[null,{"$f":"TEXT(B67,\"YYYY\")","v":"1900"},null,null,"チェック2",{"$f":"IF(F67=1,1,IF(G68,1,2))","v":2},false,null,null,{"$f":"B70&$J$6","v":"0A"},{"$f":"B70&$K$6","v":"0P"},{"$f":"B70&$L$6","v":"0N"},null,null,null,null,{"$f":"LEFT(Q67,2)","v":"18"},null,{"$f":"B67","v":"00:00:00"},{"$f":"MONTH(S67)","v":1},"月",{"$f":"T68&U68&T69&U69","v":"1月0日"},{"$f":"D67","v":0},{"$f":"LEFT(W68,3)","v":"0"}]
[null,{"$f":"TEXT(B67,\"YYYYmm\")","v":"190001"},null,null,"チェック3",2,false,null,null,{"$f":"G68","v":false},{"$f":"G69","v":false},{"$f":"G70","v":false},null,null,null,null,{"$f":"IF(MID(Q67,6,1)=\"-\",MID(Q67,7,2),MID(Q67,6,2))","v":"21"},null,null,{"$f":"DAY(S67)","v":0},"日",{"$f":"T69&U69","v":"0日"}]
[null,{"$f":"TEXT(B67,\"d\")","v":"0"},null,null,"チェック4",2,false,null,null,null,null,null,null,null,null,null,null,null,null,null,null,{"$f":"T68&U68","v":"1月"}]
[{"$f":"IF(D71=\"大会議室(準備)\",\"大会議室\",(IF(D71=\"大会議室(本番)\",\"大会議室\",(IF(D71=\"ピアザホール(準備)\",\"PH\",IF(D71=\"ピアザホール(本番)\",\"PH\",IF(D71=\"練習室(一般)\",\"練習室\",IF(D71=\"練習室(学生)\",\"練習室\",D71))))))))","v":0},{"$f":"IF(利用申込書2!A26=\"\", B67,利用申込書2!A26)","v":"00:00:00"},{"$f":"IF(OR((WEEKDAY(B71,2)>=6),COUNTIF(DATA!$Q$3:$T$23,B71)),2,1)","v":2},{"$f":"利用申込書2!F26","v":0},"チェック1",2,false,{"$f":"IF(AND($C$1=1,$C$2=1,C71=1),1,(IF(AND($C$1=1,$C$2=2,C71=1),2,(IF(AND($C$1=1,$C$2=3,C71=1),3,(IF(AND($C$1=2,$C$2=1,C71=1),4,(IF(AND($C$1=2,$C$2=2,C71=1),5,(IF(AND($C$1=2,$C$2=3,C71=1),6,(IF(AND($C$1=1,$C$2=1,C71=2),7,(IF(AND($C$1=1,$C$2=2,C71=2),8,(IF(AND($C$1=1,$C$2=3,C71=2),9,(IF(AND($C$1=2,$C$2=1,C71=2),10,(IF(AND($C$1=2,$C$2=2,C71=2),11,(IF(AND($C$1=2,$C$2=3,C71=2),12,\"\")))))))))))))))))))))))","v":7},{"$f":"CHOOSE(H71,VLOOKUP(D71,DATA!$B$2:$N$25,2,FALSE),VLOOKUP(D71,DATA!$B$2:$N$25,3,FALSE),VLOOKUP(D71,DATA!$B$2:$N$25,4,FALSE),VLOOKUP(D71,DATA!$B$2:$N$25,5,FALSE),VLOOKUP(D71,DATA!$B$2:$N$25,6,FALSE),VLOOKUP(D71,DATA!$B$2:$N$25,7,FALSE),VLOOKUP(D71,DATA!$B$2:$N$25,8,FALSE),VLOOKUP(D71,DATA!$B$2:$N$25,9,FALSE),VLOOKUP(D71,DATA!$B$2:$N$25,10,FALSE),VLOOKUP(D71,DATA!$B$2:$N$25,11,FALSE),VLOOKUP(D71,DATA!$B$2:$N$25,12,FALSE),VLOOKUP(D71,DATA!$B$2:$N$25,13,FALSE),\"\")*(IF(F71=1,1,0))","v":0},{"$f":"CHOOSE(H71,VLOOKUP(D71,DATA!$B$27:$N$50,2,FALSE),VLOOKUP(D71,DATA!$B$27:$N$50,3,FALSE),VLOOKUP(D71,DATA!$B$27:$N$50,4,FALSE),VLOOKUP(D71,DATA!$B$27:$N$50,5,FALSE),VLOOKUP(D71,DATA!$B$27:$N$50,6,FALSE),VLOOKUP(D71,DATA!$B$27:$N$50,7,FALSE),VLOOKUP(D71,DATA!$B$27:$N$50,8,FALSE),VLOOKUP(D71,DATA!$B$27:$N$50,9,FALSE),VLOOKUP(D71,DATA!$B$27:$N$50,10,FALSE),VLOOKUP(D71,DATA!$B$27:$N$50,11,FALSE),VLOOKUP(D71,DATA!$B$27:$N$50,12,FALSE),VLOOKUP(D71,DATA!$B$27:$N$50,13,FALSE),\"\")*(IF(F72=1,1,0))","v":0},{"$f":"CHOOSE(H71,VLOOKUP(D71,DATA!$B$52:$N$75,2,FALSE),VLOOKUP(D71,DATA!$B$52:$N$75,3,FALSE),VLOOKUP(D71,DATA!$B$52:$N$75,4,FALSE),VLOOKUP(D71,DATA!$B$52:$N$77,5,FALSE),VLOOKUP(D71,DATA!$B$52:$N$75,6,FALSE),VLOOKUP(D71,DATA!$B$52:$N$75,7,FALSE),VLOOKUP(D71,DATA!$B$52:$N$75,8,FALSE),VLOOKUP(D71,DATA!$B$52:$N$75,9,FALSE),VLOOKUP(D71,DATA!$B$52:$N$75,10,FALSE),VLOOKUP(D71,DATA!$B$52:$N$75,11,FALSE),VLOOKUP(D71,DATA!$B$52:$N$75,12,FALSE),VLOOKUP(D71,DATA!$B$52:$N$75,13,FALSE),\"\")*(IF(F73=1,1,0))","v":0},{"$f":"CHOOSE(H71,VLOOKUP(D71,DATA!$B$77:$N$100,2,FALSE),VLOOKUP(D71,DATA!$B$77:$N$100,3,FALSE),VLOOKUP(D71,DATA!$B$77:$N$100,4,FALSE),VLOOKUP(D71,DATA!$B$77:$N$100,5,FALSE),VLOOKUP(D71,DATA!$B$77:$N$100,6,FALSE),VLOOKUP(D71,DATA!$B$77:$N$100,7,FALSE),VLOOKUP(D71,DATA!$B$77:$N$100,8,FALSE),VLOOKUP(D71,DATA!$B$77:$N$100,9,FALSE),VLOOKUP(D71,DATA!$B$77:$N$100,10,FALSE),VLOOKUP(D71,DATA!$B$77:$N$100,11,FALSE),VLOOKUP(D71,DATA!$B$77:$N$100,12,FALSE),VLOOKUP(D71,DATA!$B$77:$N$100,13,FALSE),\"\")*(IF(F74=1,1,0))","v":0},{"$f":"CHOOSE(H71,VLOOKUP(D71,DATA!$B$102:$N$125,2,FALSE),VLOOKUP(D71,DATA!$B$102:$N$125,3,FALSE),VLOOKUP(D71,DATA!$B$102:$N$125,4,FALSE),VLOOKUP(D71,DATA!$B$102:$N$125,5,FALSE),VLOOKUP(D71,DATA!$B$102:$N$125,6,FALSE),VLOOKUP(D71,DATA!$B$102:$N$125,7,FALSE),VLOOKUP(D71,DATA!$B$102:$N$125,8,FALSE),VLOOKUP(D71,DATA!$B$102:$N$125,9,FALSE),VLOOKUP(D71,DATA!$B$102:$N$125,10,FALSE),VLOOKUP(D71,DATA!$B$102:$N$125,11,FALSE),VLOOKUP(D71,DATA!$B$102:$N$125,12,FALSE),VLOOKUP(D71,DATA!$B$102:$N$125,13,FALSE),\"\")*(IF(F74=1,1,0))","v":0},{"$f":"利用申込書2!AG26","v":""},{"$f":"IF(AND(F72=1,F73=1,F74=1),\"午前-午後-夜間\",(IF(AND(F72=1,F73=1,F74=2),\"午前-午後\",(IF(AND(F72=2,F73=1,F74=1),\"午後-夜間\",(IF(AND(F72=1,F73=2,F74=2),\"午前\",(IF(AND(F72=2,F73=1,F74=2),\"午後\",IF(AND(F72=1,F73=2,F74=1),\"午前・夜間\",\"夜間\"))))))))))","v":"夜間"},null,{"$f":"IF(I71>0,VLOOKUP(O71,$A$235:$B$238,2,FALSE),VLOOKUP(O71,$A$226:$B$232,2,FALSE))","v":"18:00-21:00"},{"$f":"IF(B71=B67,\"\",B71)","v":""},{"$f":"B71","v":"00:00:00"},{"$f":"YEAR(S71)","v":1900},"年",{"$f":"T71&U71&T72&U72","v":"1900年1月"},{"$f":"IF(AND(F72=1,F73=1,F74=1),\"APN\",(IF(AND(F72=1,F73=1,F74=2),\"AP\",(IF(AND(F72=2,F73=1,F74=1),\"PN\",(IF(AND(F72=1,F73=2,F74=2),\"A\",(IF(AND(F72=2,F73=1,F74=2),\"P\",\"N\")))))))))","v":"N"},{"$f":"利用申込書1!$AV$50","v":""},{"$f":"X72&W71&\"・\"&AB71","v":"0N・"},{"$f":"T71&U71","v":"1900年"},{"$f":"Z71&V72","v":"1900年1月0日"},{"$f":"CLEAN(X71)","v":""}]
[null,{"$f":"TEXT(B71,\"YYYY\")","v":"1900"},null,null,"チェック2",{"$f":"IF(F71=1,1,IF(G72,1,2))","v":2},false,null,null,{"$f":"B74&$J$6","v":"0A"},{"$f":"B74&$K$6","v":"0P"},{"$f":"B74&$L$6","v":"0N"},null,null,null,null,{"$f":"LEFT(Q71,2)","v":"18"},null,{"$f":"B71","v":"00:00:00"},{"$f":"MONTH(S71)","v":1},"月",{"$f":"T72&U72&T73&U73","v":"1月0日"},{"$f":"D71","v":0},{"$f":"LEFT(W72,3)","v":"0"}]
[null,{"$f":"TEXT(B71,\"YYYYmm\")","v":"190001"},null,null,"チェック3",2,false,null,null,{"$f":"G72","v":false},{"$f":"G73","v":false},{"$f":"G74","v":false},null,null,null,null,{"$f":"IF(MID(Q71,6,1)=\"-\",MID(Q71,7,2),MID(Q71,6,2))","v":"21"},null,null,{"$f":"DAY(S71)","v":0},"日",{"$f":"T73&U73","v":"0日"}]
[null,{"$f":"TEXT(B71,\"d\")","v":"0"},null,null,"チェック4",2,false,null,null,null,null,null,null,null,null,null,null,null,null,null,null,{"$f":"T72&U72","v":"1月"}]
[{"$f":"IF(D75=\"大会議室(準備)\",\"大会議室\",(IF(D75=\"大会議室(本番)\",\"大会議室\",(IF(D75=\"ピアザホール(準備)\",\"PH\",IF(D75=\"ピアザホール(本番)\",\"PH\",IF(D75=\"練習室(一般)\",\"練習室\",IF(D75=\"練習室(学生)\",\"練習室\",D75))))))))","v":0},{"$f":"IF(利用申込書2!A28=\"\", B71,利用申込書2!A28)","v":"00:00:00"},{"$f":"IF(OR((WEEKDAY(B75,2)>=6),COUNTIF(DATA!$Q$3:$T$23,B75)),2,1)","v":2},{"$f":"利用申込書2!F28","v":0},"チェック1",2,false,{"$f":"IF(AND($C$1=1,$C$2=1,C75=1),1,(IF(AND($C$1=1,$C$2=2,C75=1),2,(IF(AND($C$1=1,$C$2=3,C75=1),3,(IF(AND($C$1=2,$C$2=1,C75=1),4,(IF(AND($C$1=2,$C$2=2,C75=1),5,(IF(AND($C$1=2,$C$2=3,C75=1),6,(IF(AND($C$1=1,$C$2=1,C75=2),7,(IF(AND($C$1=1,$C$2=2,C75=2),8,(IF(AND($C$1=1,$C$2=3,C75=2),9,(IF(AND($C$1=2,$C$2=1,C75=2),10,(IF(AND($C$1=2,$C$2=2,C75=2),11,(IF(AND($C$1=2,$C$2=3,C75=2),12,\"\")))))))))))))))))))))))","v":7},{"$f":"CHOOSE(H75,VLOOKUP(D75,DATA!$B$2:$N$25,2,FALSE),VLOOKUP(D75,DATA!$B$2:$N$25,3,FALSE),VLOOKUP(D75,DATA!$B$2:$N$25,4,FALSE),VLOOKUP(D75,DATA!$B$2:$N$25,5,FALSE),VLOOKUP(D75,DATA!$B$2:$N$25,6,FALSE),VLOOKUP(D75,DATA!$B$2:$N$25,7,FALSE),VLOOKUP(D75,DATA!$B$2:$N$25,8,FALSE),VLOOKUP(D75,DATA!$B$2:$N$25,9,FALSE),VLOOKUP(D75,DATA!$B$2:$N$25,10,FALSE),VLOOKUP(D75,DATA!$B$2:$N$25,11,FALSE),VLOOKUP(D75,DATA!$B$2:$N$25,12,FALSE),VLOOKUP(D75,DATA!$B$2:$N$25,13,FALSE),\"\")*(IF(F75=1,1,0))","v":0},{"$f":"CHOOSE(H75,VLOOKUP(D75,DATA!$B$27:$N$50,2,FALSE),VLOOKUP(D75,DATA!$B$27:$N$50,3,FALSE),VLOOKUP(D75,DATA!$B$27:$N$50,4,FALSE),VLOOKUP(D75,DATA!$B$27:$N$50,5,FALSE),VLOOKUP(D75,DATA!$B$27:$N$50,6,FALSE),VLOOKUP(D75,DATA!$B$27:$N$50,7,FALSE),VLOOKUP(D75,DATA!$B$27:$N$50,8,FALSE),VLOOKUP(D75,DATA!$B$27:$N$50,9,FALSE),VLOOKUP(D75,DATA!$B$27:$N$50,10,FALSE),VLOOKUP(D75,DATA!$B$27:$N$50,11,FALSE),VLOOKUP(D75,DATA!$B$27:$N$50,12,FALSE),VLOOKUP(D75,DATA!$B$27:$N$50,13,FALSE),\"\")*(IF(F76=1,1,0))","v":0},{"$f":"CHOOSE(H75,VLOOKUP(D75,DATA!$B$52:$N$75,2,FALSE),VLOOKUP(D75,DATA!$B$52:$N$75,3,FALSE),VLOOKUP(D75,DATA!$B$52:$N$75,4,FALSE),VLOOKUP(D75,DATA!$B$52:$N$77,5,FALSE),VLOOKUP(D75,DATA!$B$52:$N$75,6,FALSE),VLOOKUP(D75,DATA!$B$52:$N$75,7,FALSE),VLOOKUP(D75,DATA!$B$52:$N$75,8,FALSE),VLOOKUP(D75,DATA!$B$52:$N$75,9,FALSE),VLOOKUP(D75,DATA!$B$52:$N$75,10,FALSE),VLOOKUP(D75,DATA!$B$52:$N$75,11,FALSE),VLOOKUP(D75,DATA!$B$52:$N$75,12,FALSE),VLOOKUP(D75,DATA!$B$52:$N$75,13,FALSE),\"\")*(IF(F77=1,1,0))","v":0},{"$f":"CHOOSE(H75,VLOOKUP(D75,DATA!$B$77:$N$100,2,FALSE),VLOOKUP(D75,DATA!$B$77:$N$100,3,FALSE),VLOOKUP(D75,DATA!$B$77:$N$100,4,FALSE),VLOOKUP(D75,DATA!$B$77:$N$100,5,FALSE),VLOOKUP(D75,DATA!$B$77:$N$100,6,FALSE),VLOOKUP(D75,DATA!$B$77:$N$100,7,FALSE),VLOOKUP(D75,DATA!$B$77:$N$100,8,FALSE),VLOOKUP(D75,DATA!$B$77:$N$100,9,FALSE),VLOOKUP(D75,DATA!$B$77:$N$100,10,FALSE),VLOOKUP(D75,DATA!$B$77:$N$100,11,FALSE),VLOOKUP(D75,DATA!$B$77:$N$100,12,FALSE),VLOOKUP(D75,DATA!$B$77:$N$100,13,FALSE),\"\")*(IF(F78=1,1,0))","v":0},{"$f":"CHOOSE(H75,VLOOKUP(D75,DATA!$B$102:$N$125,2,FALSE),VLOOKUP(D75,DATA!$B$102:$N$125,3,FALSE),VLOOKUP(D75,DATA!$B$102:$N$125,4,FALSE),VLOOKUP(D75,DATA!$B$102:$N$125,5,FALSE),VLOOKUP(D75,DATA!$B$102:$N$125,6,FALSE),VLOOKUP(D75,DATA!$B$102:$N$125,7,FALSE),VLOOKUP(D75,DATA!$B$102:$N$125,8,FALSE),VLOOKUP(D75,DATA!$B$102:$N$125,9,FALSE),VLOOKUP(D75,DATA!$B$102:$N$125,10,FALSE),VLOOKUP(D75,DATA!$B$102:$N$125,11,FALSE),VLOOKUP(D75,DATA!$B$102:$N$125,12,FALSE),VLOOKUP(D75,DATA!$B$102:$N$125,13,FALSE),\"\")*(IF(F78=1,1,0))","v":0},{"$f":"利用申込書2!AG28","v":""},{"$f":"IF(AND(F76=1,F77=1,F78=1),\"午前-午後-夜間\",(IF(AND(F76=1,F77=1,F78=2),\"午前-午後\",(IF(AND(F76=2,F77=1,F78=1),\"午後-夜間\",(IF(AND(F76=1,F77=2,F78=2),\"午前\",(IF(AND(F76=2,F77=1,F78=2),\"午後\",IF(AND(F76=1,F77=2,F78=1),\"午前・夜間\",\"夜間\"))))))))))","v":"夜間"},null,{"$f":"IF(I75>0,VLOOKUP(O75,$A$235:$B$238,2,FALSE),VLOOKUP(O75,$A$226:$B$232,2,FALSE))","v":"18:00-21:00"},{"$f":"IF(B75=B71,\"\",B75)","v":""},{"$f":"B75","v":"00:00:00"},{"$f":"YEAR(S75)","v":1900},"年",{"$f":"T75&U75&T76&U76","v":"1900年1月"},{"$f":"IF(AND(F76=1,F77=1,F78=1),\"APN\",(IF(AND(F76=1,F77=1,F78=2),\"AP\",(IF(AND(F76=2,F77=1,F78=1),\"PN\",(IF(AND(F76=1,F77=2,F78=2),\"A\",(IF(AND(F76=2,F77=1,F78=2),\"P\",\"N\")))))))))","v":"N"},{"$f":"利用申込書1!$AV$50","v":""},{"$f":"X76&W75&\"・\"&AB75","v":"0N・"},{"$f":"T75&U75","v":"1900年"},{"$f":"Z75&V76","v":"1900年1月0日"},{"$f":"CLEAN(X75)","v":""}]
[null,{"$f":"TEXT(B75,\"YYYY\")","v":"1900"},null,null,"チェック2",{"$f":"IF(F75=1,1,IF(G76,1,2))","v":2},false,null,null,{"$f":"B78&$J$6","v":"0A"},{"$f":"B78&$K$6","v":"0P"},{"$f":"B78&$L$6","v":"0N"},null,null,null,null,{"$f":"LEFT(Q75,2)","v":"18"},null,{"$f":"B75","v":"00:00:00"},{"$f":"MONTH(S75)","v":1},"月",{"$f":"T76&U76&T77&U77","v":"1月0日"},{"$f":"D75","v":0},{"$f":"LEFT(W76,3)","v":"0"}]
[null,{"$f":"TEXT(B75,\"YYYYmm\")","v":"190001"},null,null,"チェック3",2,false,null,null,{"$f":"G76","v":false},{"$f":"G77","v":false},{"$f":"G78","v":false},null,null,null,null,{"$f":"IF(MID(Q75,6,1)=\"-\",MID(Q75,7,2),MID(Q75,6,2))","v":"21"},null,null,{"$f":"DAY(S75)","v":0},"日",{"$f":"T77&U77","v":"0日"}]
[null,{"$f":"TEXT(B75,\"d\")","v":"0"},null,null,"チェック4",2,false,null,null,null,null,null,null,null,null,null,null,null,null,null,null,{"$f":"T76&U76","v":"1月"}]
[{"$f":"IF(D79=\"大会議室(準備)\",\"大会議室\",(IF(D79=\"大会議室(本番)\",\"大会議室\",(IF(D79=\"ピアザホール(準備)\",\"PH\",IF(D79=\"ピアザホール(本番)\",\"PH\",IF(D79=\"練習室(一般)\",\"練習室\",IF(D79=\"練習室(学生)\",\"練習室\",D79))))))))","v":0},{"$f":"IF(利用申込書2!A30=\"\",B75,利用申込書2!A30)","v":"00:00:00"},{"$f":"IF(OR((WEEKDAY(B79,2)>=6),COUNTIF(DATA!$Q$3:$T$23,B79)),2,1)","v":2},{"$f":"利用申込書2!F30","v":0},"チェック1",2,false,{"$f":"IF(AND($C$1=1,$C$2=1,C79=1),1,(IF(AND($C$1=1,$C$2=2,C79=1),2,(IF(AND($C$1=1,$C$2=3,C79=1),3,(IF(AND($C$1=2,$C$2=1,C79=1),4,(IF(AND($C$1=2,$C$2=2,C79=1),5,(IF(AND($C$1=2,$C$2=3,C79=1),6,(IF(AND($C$1=1,$C$2=1,C79=2),7,(IF(AND($C$1=1,$C$2=2,C79=2),8,(IF(AND($C$1=1,$C$2=3,C79=2),9,(IF(AND($C$1=2,$C$2=1,C79=2),10,(IF(AND($C$1=2,$C$2=2,C79=2),11,(IF(AND($C$1=2,$C$2=3,C79=2),12,\"\")))))))))))))))))))))))","v":7},{"$f":"CHOOSE(H79,VLOOKUP(D79,DATA!$B$2:$N$25,2,FALSE),VLOOKUP(D79,DATA!$B$2:$N$25,3,FALSE),VLOOKUP(D79,DATA!$B$2:$N$25,4,FALSE),VLOOKUP(D79,DATA!$B$2:$N$25,5,FALSE),VLOOKUP(D79,DATA!$B$2:$N$25,6,FALSE),VLOOKUP(D79,DATA!$B$2:$N$25,7,FALSE),VLOOKUP(D79,DATA!$B$2:$N$25,8,FALSE),VLOOKUP(D79,DATA!$B$2:$N$25,9,FALSE),VLOOKUP(D79,DATA!$B$2:$N$25,10,FALSE),VLOOKUP(D79,DATA!$B$2:$N$25,11,FALSE),VLOOKUP(D79,DATA!$B$2:$N$25,12,FALSE),VLOOKUP(D79,DATA!$B$2:$N$25,13,FALSE),\"\")*(IF(F79=1,1,0))","v":0},{"$f":"CHOOSE(H79,VLOOKUP(D79,DATA!$B$27:$N$50,2,FALSE),VLOOKUP(D79,DATA!$B$27:$N$50,3,FALSE),VLOOKUP(D79,DATA!$B$27:$N$50,4,FALSE),VLOOKUP(D79,DATA!$B$27:$N$50,5,FALSE),VLOOKUP(D79,DATA!$B$27:$N$50,6,FALSE),VLOOKUP(D79,DATA!$B$27:$N$50,7,FALSE),VLOOKUP(D79,DATA!$B$27:$N$50,8,FALSE),VLOOKUP(D79,DATA!$B$27:$N$50,9,FALSE),VLOOKUP(D79,DATA!$B$27:$N$50,10,FALSE),VLOOKUP(D79,DATA!$B$27:$N$50,11,FALSE),VLOOKUP(D79,DATA!$B$27:$N$50,12,FALSE),VLOOKUP(D79,DATA!$B$27:$N$50,13,FALSE),\"\")*(IF(F80=1,1,0))","v":0},{"$f":"CHOOSE(H79,VLOOKUP(D79,DATA!$B$52:$N$75,2,FALSE),VLOOKUP(D79,DATA!$B$52:$N$75,3,FALSE),VLOOKUP(D79,DATA!$B$52:$N$75,4,FALSE),VLOOKUP(D79,DATA!$B$52:$N$77,5,FALSE),VLOOKUP(D79,DATA!$B$52:$N$75,6,FALSE),VLOOKUP(D79,DATA!$B$52:$N$75,7,FALSE),VLOOKUP(D79,DATA!$B$52:$N$75,8,FALSE),VLOOKUP(D79,DATA!$B$52:$N$75,9,FALSE),VLOOKUP(D79,DATA!$B$52:$N$75,10,FALSE),VLOOKUP(D79,DATA!$B$52:$N$75,11,FALSE),VLOOKUP(D79,DATA!$B$52:$N$75,12,FALSE),VLOOKUP(D79,DATA!$B$52:$N$75,13,FALSE),\"\")*(IF(F81=1,1,0))","v":0},{"$f":"CHOOSE(H79,VLOOKUP(D79,DATA!$B$77:$N$100,2,FALSE),VLOOKUP(D79,DATA!$B$77:$N$100,3,FALSE),VLOOKUP(D79,DATA!$B$77:$N$100,4,FALSE),VLOOKUP(D79,DATA!$B$77:$N$100,5,FALSE),VLOOKUP(D79,DATA!$B$77:$N$100,6,FALSE),VLOOKUP(D79,DATA!$B$77:$N$100,7,FALSE),VLOOKUP(D79,DATA!$B$77:$N$100,8,FALSE),VLOOKUP(D79,DATA!$B$77:$N$100,9,FALSE),VLOOKUP(D79,DATA!$B$77:$N$100,10,FALSE),VLOOKUP(D79,DATA!$B$77:$N$100,11,FALSE),VLOOKUP(D79,DATA!$B$77:$N$100,12,FALSE),VLOOKUP(D79,DATA!$B$77:$N$100,13,FALSE),\"\")*(IF(F82=1,1,0))","v":0},{"$f":"CHOOSE(H79,VLOOKUP(D79,DATA!$B$102:$N$125,2,FALSE),VLOOKUP(D79,DATA!$B$102:$N$125,3,FALSE),VLOOKUP(D79,DATA!$B$102:$N$125,4,FALSE),VLOOKUP(D79,DATA!$B$102:$N$125,5,FALSE),VLOOKUP(D79,DATA!$B$102:$N$125,6,FALSE),VLOOKUP(D79,DATA!$B$102:$N$125,7,FALSE),VLOOKUP(D79,DATA!$B$102:$N$125,8,FALSE),VLOOKUP(D79,DATA!$B$102:$N$125,9,FALSE),VLOOKUP(D79,DATA!$B$102:$N$125,10,FALSE),VLOOKUP(D79,DATA!$B$102:$N$125,11,FALSE),VLOOKUP(D79,DATA!$B$102:$N$125,12,FALSE),VLOOKUP(D79,DATA!$B$102:$N$125,13,FALSE),\"\")*(IF(F82=1,1,0))","v":0},{"$f":"利用申込書2!AG30","v":""},{"$f":"IF(AND(F80=1,F81=1,F82=1),\"午前-午後-夜間\",(IF(AND(F80=1,F81=1,F82=2),\"午前-午後\",(IF(AND(F80=2,F81=1,F82=1),\"午後-夜間\",(IF(AND(F80=1,F81=2,F82=2),\"午前\",(IF(AND(F80=2,F81=1,F82=2),\"午後\",IF(AND(F80=1,F81=2,F82=1),\"午前・夜間\",\"夜間\"))))))))))","v":"夜間"},null,{"$f":"IF(I79>0,VLOOKUP(O79,$A$235:$B$238,2,FALSE),VLOOKUP(O79,$A$226:$B$232,2,FALSE))","v":"18:00-21:00"},{"$f":"IF(B79=B75,\"\",B79)","v":""},{"$f":"B79","v":"00:00:00"},{"$f":"YEAR(S79)","v":1900},"年",{"$f":"T79&U79&T80&U80","v":"1900年1月"},{"$f":"IF(AND(F80=1,F81=1,F82=1),\"APN\",(IF(AND(F80=1,F81=1,F82=2),\"AP\",(IF(AND(F80=2,F81=1,F82=1),\"PN\",(IF(AND(F80=1,F81=2,F82=2),\"A\",(IF(AND(F80=2,F81=1,F82=2),\"P\",\"N\")))))))))","v":"N"},{"$f":"利用申込書1!$AV$50","v":""},{"$f":"X80&W79&\"・\"&AB79","v":"0N・"},{"$f":"T79&U79","v":"1900年"},{"$f":"Z79&V80","v":"1900年1月0日"},{"$f":"CLEAN(X79)","v":""}]
[null,{"$f":"TEXT(B79,\"YYYY\")","v":"1900"},null,null,"チェック2",{"$f":"IF(F79=1,1,IF(G80,1,2))","v":2},false,null,null,{"$f":"B82&$J$6","v":"0A"},{"$f":"B82&$K$6","v":"0P"},{"$f":"B82&$L$6","v":"0N"},null,null,null,null,{"$f":"LEFT(Q79,2)","v":"18"},null,{"$f":"B79","v":"00:00:00"},{"$f":"MONTH(S79)","v":1},"月",{"$f":"T80&U80&T81&U81","v":"1月0日"},{"$f":"D79","v":0},{"$f":"LEFT(W80,3)","v":"0"}]
[null,{"$f":"TEXT(B79,\"YYYYmm\")","v":"190001"},null,null,"チェック3",2,false,null,null,{"$f":"G80","v":false},{"$f":"G81","v":false},{"$f":"G82","v":false},null,null,null,null,{"$f":"IF(MID(Q79,6,1)=\"-\",MID(Q79,7,2),MID(Q79,6,2))","v":"21"},null,null,{"$f":"DAY(S79)","v":0},"日",{"$f":"T81&U81","v":"0日"}]
[null,{"$f":"TEXT(B79,\"d\")","v":"0"},null,null,"チェック4",2,false,null,null,null,null,null,null,null,null,null,null,null,null,null,null,{"$f":"T80&U80","v":"1月"}]
[{"$f":"IF(D83=\"大会議室(準備)\",\"大会議室\",(IF(D83=\"大会議室(本番)\",\"大会議室\",(IF(D83=\"ピアザホール(準備)\",\"PH\",IF(D83=\"ピアザホール(本番)\",\"PH\",IF(D83=\"練習室(一般)\",\"練習室\",IF(D83=\"練習室(学生)\",\"練習室\",D83))))))))","v":0},{"$f":"IF(利用申込書2!A32=\"\", B79,利用申込書2!A32)","v":"00:00:00"},{"$f":"IF(OR((WEEKDAY(B83,2)>=6),COUNTIF(DATA!$Q$3:$T$23,B83)),2,1)","v":2},{"$f":"利用申込書2!F32","v":0},"チェック1",2,false,{"$f":"IF(AND($C$1=1,$C$2=1,C83=1),1,(IF(AND($C$1=1,$C$2=2,C83=1),2,(IF(AND($C$1=1,$C$2=3,C83=1),3,(IF(AND($C$1=2,$C$2=1,C83=1),4,(IF(AND($C$1=2,$C$2=2,C83=1),5,(IF(AND($C$1=2,$C$2=3,C83=1),6,(IF(AND($C$1=1,$C$2=1,C83=2),7,(IF(AND($C$1=1,$C$2=2,C83=2),8,(IF(AND($C$1=1,$C$2=3,C83=2),9,(IF(AND($C$1=2,$C$2=1,C83=2),10,(IF(AND($C$1=2,$C$2=2,C83=2),11,(IF(AND($C$1=2,$C$2=3,C83=2),12,\"\")))))))))))))))))))))))","v":7},{"$f":"CHOOSE(H83,VLOOKUP(D83,DATA!$B$2:$N$25,2,FALSE),VLOOKUP(D83,DATA!$B$2:$N$25,3,FALSE),VLOOKUP(D83,DATA!$B$2:$N$25,4,FALSE),VLOOKUP(D83,DATA!$B$2:$N$25,5,FALSE),VLOOKUP(D83,DATA!$B$2:$N$25,6,FALSE),VLOOKUP(D83,DATA!$B$2:$N$25,7,FALSE),VLOOKUP(D83,DATA!$B$2:$N$25,8,FALSE),VLOOKUP(D83,DATA!$B$2:$N$25,9,FALSE),VLOOKUP(D83,DATA!$B$2:$N$25,10,FALSE),VLOOKUP(D83,DATA!$B$2:$N$25,11,FALSE),VLOOKUP(D83,DATA!$B$2:$N$25,12,FALSE),VLOOKUP(D83,DATA!$B$2:$N$25,13,FALSE),\"\")*(IF(F83=1,1,0))","v":0},{"$f":"CHOOSE(H83,VLOOKUP(D83,DATA!$B$27:$N$50,2,FALSE),VLOOKUP(D83,DATA!$B$27:$N$50,3,FALSE),VLOOKUP(D83,DATA!$B$27:$N$50,4,FALSE),VLOOKUP(D83,DATA!$B$27:$N$50,5,FALSE),VLOOKUP(D83,DATA!$B$27:$N$50,6,FALSE),VLOOKUP(D83,DATA!$B$27:$N$50,7,FALSE),VLOOKUP(D83,DATA!$B$27:$N$50,8,FALSE),VLOOKUP(D83,DATA!$B$27:$N$50,9,FALSE),VLOOKUP(D83,DATA!$B$27:$N$50,10,FALSE),VLOOKUP(D83,DATA!$B$27:$N$50,11,FALSE),VLOOKUP(D83,DATA!$B$27:$N$50,12,FALSE),VLOOKUP(D83,DATA!$B$27:$N$50,13,FALSE),\"\")*(IF(F84=1,1,0))","v":0},{"$f":"CHOOSE(H83,VLOOKUP(D83,DATA!$B$52:$N$75,2,FALSE),VLOOKUP(D83,DATA!$B$52:$N$75,3,FALSE),VLOOKUP(D83,DATA!$B$52:$N$75,4,FALSE),VLOOKUP(D83,DATA!$B$52:$N$77,5,FALSE),VLOOKUP(D83,DATA!$B$52:$N$75,6,FALSE),VLOOKUP(D83,DATA!$B$52:$N$75,7,FALSE),VLOOKUP(D83,DATA!$B$52:$N$75,8,FALSE),VLOOKUP(D83,DATA!$B$52:$N$75,9,FALSE),VLOOKUP(D83,DATA!$B$52:$N$75,10,FALSE),VLOOKUP(D83,DATA!$B$52:$N$75,11,FALSE),VLOOKUP(D83,DATA!$B$52:$N$75,12,FALSE),VLOOKUP(D83,DATA!$B$52:$N$75,13,FALSE),\"\")*(IF(F85=1,1,0))","v":0},{"$f":"CHOOSE(H83,VLOOKUP(D83,DATA!$B$77:$N$100,2,FALSE),VLOOKUP(D83,DATA!$B$77:$N$100,3,FALSE),VLOOKUP(D83,DATA!$B$77:$N$100,4,FALSE),VLOOKUP(D83,DATA!$B$77:$N$100,5,FALSE),VLOOKUP(D83,DATA!$B$77:$N$100,6,FALSE),VLOOKUP(D83,DATA!$B$77:$N$100,7,FALSE),VLOOKUP(D83,DATA!$B$77:$N$100,8,FALSE),VLOOKUP(D83,DATA!$B$77:$N$100,9,FALSE),VLOOKUP(D83,DATA!$B$77:$N$100,10,FALSE),VLOOKUP(D83,DATA!$B$77:$N$100,11,FALSE),VLOOKUP(D83,DATA!$B$77:$N$100,12,FALSE),VLOOKUP(D83,DATA!$B$77:$N$100,13,FALSE),\"\")*(IF(F86=1,1,0))","v":0},{"$f":"CHOOSE(H83,VLOOKUP(D83,DATA!$B$102:$N$125,2,FALSE),VLOOKUP(D83,DATA!$B$102:$N$125,3,FALSE),VLOOKUP(D83,DATA!$B$102:$N$125,4,FALSE),VLOOKUP(D83,DATA!$B$102:$N$125,5,FALSE),VLOOKUP(D83,DATA!$B$102:$N$125,6,FALSE),VLOOKUP(D83,DATA!$B$102:$N$125,7,FALSE),VLOOKUP(D83,DATA!$B$102:$N$125,8,FALSE),VLOOKUP(D83,DATA!$B$102:$N$125,9,FALSE),VLOOKUP(D83,DATA!$B$102:$N$125,10,FALSE),VLOOKUP(D83,DATA!$B$102:$N$125,11,FALSE),VLOOKUP(D83,DATA!$B$102:$N$125,12,FALSE),VLOOKUP(D83,DATA!$B$102:$N$125,13,FALSE),\"\")*(IF(F86=1,1,0))","v":0},{"$f":"利用申込書2!AG32","v":""},{"$f":"IF(AND(F84=1,F85=1,F86=1),\"午前-午後-夜間\",(IF(AND(F84=1,F85=1,F86=2),\"午前-午後\",(IF(AND(F84=2,F85=1,F86=1),\"午後-夜間\",(IF(AND(F84=1,F85=2,F86=2),\"午前\",(IF(AND(F84=2,F85=1,F86=2),\"午後\",IF(AND(F84=1,F85=2,F86=1),\"午前・夜間\",\"夜間\"))))))))))","v":"夜間"},null,{"$f":"IF(I83>0,VLOOKUP(O83,$A$235:$B$238,2,FALSE),VLOOKUP(O83,$A$226:$B$232,2,FALSE))","v":"18:00-21:00"},{"$f":"IF(B83=B79,\"\",B83)","v":""},{"$f":"B83","v":"00:00:00"},{"$f":"YEAR(S83)","v":1900},"年",{"$f":"T83&U83&T84&U84","v":"1900年1月"},{"$f":"IF(AND(F84=1,F85=1,F86=1),\"APN\",(IF(AND(F84=1,F85=1,F86=2),\"AP\",(IF(AND(F84=2,F85=1,F86=1),\"PN\",(IF(AND(F84=1,F85=2,F86=2),\"A\",(IF(AND(F84=2,F85=1,F86=2),\"P\",\"N\")))))))))","v":"N"},{"$f":"利用申込書1!$AV$50","v":""},{"$f":"X84&W83&\"・\"&AB83","v":"0N・"},{"$f":"T83&U83","v":"1900年"},{"$f":"Z83&V84","v":"1900年1月0日"},{"$f":"CLEAN(X83)","v":""}]
[null,{"$f":"TEXT(B83,\"YYYY\")","v":"1900"},null,null,"チェック2",{"$f":"IF(F83=1,1,IF(G84,1,2))","v":2},false,null,null,{"$f":"B86&$J$6","v":"0A"},{"$f":"B86&$K$6","v":"0P"},{"$f":"B86&$L$6","v":"0N"},null,null,null,null,{"$f":"LEFT(Q83,2)","v":"18"},null,{"$f":"B83","v":"00:00:00"},{"$f":"MONTH(S83)","v":1},"月",{"$f":"T84&U84&T85&U85","v":"1月0日"},{"$f":"D83","v":0},{"$f":"LEFT(W84,3)","v":"0"}]
[null,{"$f":"TEXT(B83,\"YYYYmm\")","v":"190001"},null,null,"チェック3",2,false,null,null,{"$f":"G84","v":false},{"$f":"G85","v":false},{"$f":"G86","v":false},null,null,null,null,{"$f":"IF(MID(Q83,6,1)=\"-\",MID(Q83,7,2),MID(Q83,6,2))","v":"21"},null,null,{"$f":"DAY(S83)","v":0},"日",{"$f":"T85&U85","v":"0日"}]
[null,{"$f":"TEXT(B83,\"d\")","v":"0"},null,null,"チェック4",2,false,null,null,null,null,null,null,null,null,null,null,null,null,null,null,{"$f":"T84&U84","v":"1月"}]
[{"$f":"IF(D87=\"大会議室(準備)\",\"大会議室\",(IF(D87=\"大会議室(本番)\",\"大会議室\",(IF(D87=\"ピアザホール(準備)\",\"PH\",IF(D87=\"ピアザホール(本番)\",\"PH\",IF(D87=\"練習室(一般)\",\"練習室\",IF(D87=\"練習室(学生)\",\"練習室\",D87))))))))","v":0},{"$f":"IF(利用申込書2!A34=\"\", B83,利用申込書2!A34)","v":"00:00:00"},{"$f":"IF(OR((WEEKDAY(B87,2)>=6),COUNTIF(DATA!$Q$3:$T$23,B87)),2,1)","v":2},{"$f":"利用申込書2!F34","v":0},"チェック1",2,false,{"$f":"IF(AND($C$1=1,$C$2=1,C87=1),1,(IF(AND($C$1=1,$C$2=2,C87=1),2,(IF(AND($C$1=1,$C$2=3,C87=1),3,(IF(AND($C$1=2,$C$2=1,C87=1),4,(IF(AND($C$1=2,$C$2=2,C87=1),5,(IF(AND($C$1=2,$C$2=3,C87=1),6,(IF(AND($C$1=1,$C$2=1,C87=2),7,(IF(AND($C$1=1,$C$2=2,C87=2),8,(IF(AND($C$1=1,$C$2=3,C87=2),9,(IF(AND($C$1=2,$C$2=1,C87=2),10,(IF(AND($C$1=2,$C$2=2,C87=2),11,(IF(AND($C$1=2,$C$2=3,C87=2),12,\"\")))))))))))))))))))))))","v":7},{"$f":"CHOOSE(H87,VLOOKUP(D87,DATA!$B$2:$N$25,2,FALSE),VLOOKUP(D87,DATA!$B$2:$N$25,3,FALSE),VLOOKUP(D87,DATA!$B$2:$N$25,4,FALSE),VLOOKUP(D87,DATA!$B$2:$N$25,5,FALSE),VLOOKUP(D87,DATA!$B$2:$N$25,6,FALSE),VLOOKUP(D87,DATA!$B$2:$N$25,7,FALSE),VLOOKUP(D87,DATA!$B$2:$N$25,8,FALSE),VLOOKUP(D87,DATA!$B$2:$N$25,9,FALSE),VLOOKUP(D87,DATA!$B$2:$N$25,10,FALSE),VLOOKUP(D87,DATA!$B$2:$N$25,11,FALSE),VLOOKUP(D87,DATA!$B$2:$N$25,12,FALSE),VLOOKUP(D87,DATA!$B$2:$N$25,13,FALSE),\"\")*(IF(F87=1,1,0))","v":0},{"$f":"CHOOSE(H87,VLOOKUP(D87,DATA!$B$27:$N$50,2,FALSE),VLOOKUP(D87,DATA!$B$27:$N$50,3,FALSE),VLOOKUP(D87,DATA!$B$27:$N$50,4,FALSE),VLOOKUP(D87,DATA!$B$27:$N$50,5,FALSE),VLOOKUP(D87,DATA!$B$27:$N$50,6,FALSE),VLOOKUP(D87,DATA!$B$27:$N$50,7,FALSE),VLOOKUP(D87,DATA!$B$27:$N$50,8,FALSE),VLOOKUP(D87,DATA!$B$27:$N$50,9,FALSE),VLOOKUP(D87,DATA!$B$27:$N$50,10,FALSE),VLOOKUP(D87,DATA!$B$27:$N$50,11,FALSE),VLOOKUP(D87,DATA!$B$27:$N$50,12,FALSE),VLOOKUP(D87,DATA!$B$27:$N$50,13,FALSE),\"\")*(IF(F88=1,1,0))","v":0},{"$f":"CHOOSE(H87,VLOOKUP(D87,DATA!$B$52:$N$75,2,FALSE),VLOOKUP(D87,DATA!$B$52:$N$75,3,FALSE),VLOOKUP(D87,DATA!$B$52:$N$75,4,FALSE),VLOOKUP(D87,DATA!$B$52:$N$77,5,FALSE),VLOOKUP(D87,DATA!$B$52:$N$75,6,FALSE),VLOOKUP(D87,DATA!$B$52:$N$75,7,FALSE),VLOOKUP(D87,DATA!$B$52:$N$75,8,FALSE),VLOOKUP(D87,DATA!$B$52:$N$75,9,FALSE),VLOOKUP(D87,DATA!$B$52:$N$75,10,FALSE),VLOOKUP(D87,DATA!$B$52:$N$75,11,FALSE),VLOOKUP(D87,DATA!$B$52:$N$75,12,FALSE),VLOOKUP(D87,DATA!$B$52:$N$75,13,FALSE),\"\")*(IF(F89=1,1,0))","v":0},{"$f":"CHOOSE(H87,VLOOKUP(D87,DATA!$B$77:$N$100,2,FALSE),VLOOKUP(D87,DATA!$B$77:$N$100,3,FALSE),VLOOKUP(D87,DATA!$B$77:$N$100,4,FALSE),VLOOKUP(D87,DATA!$B$77:$N$100,5,FALSE),VLOOKUP(D87,DATA!$B$77:$N$100,6,FALSE),VLOOKUP(D87,DATA!$B$77:$N$100,7,FALSE),VLOOKUP(D87,DATA!$B$77:$N$100,8,FALSE),VLOOKUP(D87,DATA!$B$77:$N$100,9,FALSE),VLOOKUP(D87,DATA!$B$77:$N$100,10,FALSE),VLOOKUP(D87,DATA!$B$77:$N$100,11,FALSE),VLOOKUP(D87,DATA!$B$77:$N$100,12,FALSE),VLOOKUP(D87,DATA!$B$77:$N$100,13,FALSE),\"\")*(IF(F90=1,1,0))","v":0},{"$f":"CHOOSE(H87,VLOOKUP(D87,DATA!$B$102:$N$125,2,FALSE),VLOOKUP(D87,DATA!$B$102:$N$125,3,FALSE),VLOOKUP(D87,DATA!$B$102:$N$125,4,FALSE),VLOOKUP(D87,DATA!$B$102:$N$125,5,FALSE),VLOOKUP(D87,DATA!$B$102:$N$125,6,FALSE),VLOOKUP(D87,DATA!$B$102:$N$125,7,FALSE),VLOOKUP(D87,DATA!$B$102:$N$125,8,FALSE),VLOOKUP(D87,DATA!$B$102:$N$125,9,FALSE),VLOOKUP(D87,DATA!$B$102:$N$125,10,FALSE),VLOOKUP(D87,DATA!$B$102:$N$125,11,FALSE),VLOOKUP(D87,DATA!$B$102:$N$125,12,FALSE),VLOOKUP(D87,DATA!$B$102:$N$125,13,FALSE),\"\")*(IF(F90=1,1,0))","v":0},{"$f":"利用申込書2!AG34","v":""},{"$f":"IF(AND(F88=1,F89=1,F90=1),\"午前-午後-夜間\",(IF(AND(F88=1,F89=1,F90=2),\"午前-午後\",(IF(AND(F88=2,F89=1,F90=1),\"午後-夜間\",(IF(AND(F88=1,F89=2,F90=2),\"午前\",(IF(AND(F88=2,F89=1,F90=2),\"午後\",IF(AND(F88=1,F89=2,F90=1),\"午前・夜間\",\"夜間\"))))))))))","v":"夜間"},null,{"$f":"IF(I87>0,VLOOKUP(O87,$A$235:$B$238,2,FALSE),VLOOKUP(O87,$A$226:$B$232,2,FALSE))","v":"18:00-21:00"},{"$f":"IF(B87=B83,\"\",B87)","v":""},{"$f":"B87","v":"00:00:00"},{"$f":"YEAR(S87)","v":1900},"年",{"$f":"T87&U87&T88&U88","v":"1900年1月"},{"$f":"IF(AND(F88=1,F89=1,F90=1),\"APN\",(IF(AND(F88=1,F89=1,F90=2),\"AP\",(IF(AND(F88=2,F89=1,F90=1),\"PN\",(IF(AND(F88=1,F89=2,F90=2),\"A\",(IF(AND(F88=2,F89=1,F90=2),\"P\",\"N\")))))))))","v":"N"},{"$f":"利用申込書1!$AV$50","v":""},{"$f":"X88&W87&\"・\"&AB87","v":"0N・"},{"$f":"T87&U87","v":"1900年"},null,{"$f":"CLEAN(X87)","v":""}]
[null,{"$f":"TEXT(B87,\"YYYY\")","v":"1900"},null,null,"チェック2",{"$f":"IF(F87=1,1,IF(G88,1,2))","v":2},false,null,null,{"$f":"B90&$J$6","v":"0A"},{"$f":"B90&$K$6","v":"0P"},{"$f":"B90&$L$6","v":"0N"},null,null,null,null,null,null,{"$f":"B87","v":"00:00:00"},{"$f":"MONTH(S87)","v":1},"月",{"$f":"T88&U88&T89&U89","v":"1月0日"},{"$f":"D87","v":0},{"$f":"LEFT(W88,3)","v":"0"}]
[null,{"$f":"TEXT(B87,\"YYYYmm\")","v":"190001"},null,null,"チェック3",2,false,null,null,{"$f":"G88","v":false},{"$f":"G89","v":false},{"$f":"G90","v":false},null,null,null,null,null,null,null,{"$f":"DAY(S87)","v":0},"日",{"$f":"T89&U89","v":"0日"}]
[null,{"$f":"TEXT(B87,\"d\")","v":"0"},null,null,"チェック4",2,false,null,null,null,null,null,null,null,null,null,null,null,null,null,null,{"$f":"T88&U88","v":"1月"}]
[{"$f":"IF(D91=\"大会議室(準備)\",\"大会議室\",(IF(D91=\"大会議室(本番)\",\"大会議室\",(IF(D91=\"ピアザホール(準備)\",\"PH\",IF(D91=\"ピアザホール(本番)\",\"PH\",IF(D91=\"練習室(一般)\",\"練習室\",IF(D91=\"練習室(学生)\",\"練習室\",D91))))))))","v":0},{"$f":"IF(利用申込書2!A36=\"\",B87,利用申込書2!A36)","v":"00:00:00"},{"$f":"IF(OR((WEEKDAY(B91,2)>=6),COUNTIF(DATA!$Q$3:$T$23,B91)),2,1)","v":2},{"$f":"利用申込書2!F36","v":0},"チェック1",2,false,{"$f":"IF(AND($C$1=1,$C$2=1,C91=1),1,(IF(AND($C$1=1,$C$2=2,C91=1),2,(IF(AND($C$1=1,$C$2=3,C91=1),3,(IF(AND($C$1=2,$C$2=1,C91=1),4,(IF(AND($C$1=2,$C$2=2,C91=1),5,(IF(AND($C$1=2,$C$2=3,C91=1),6,(IF(AND($C$1=1,$C$2=1,C91=2),7,(IF(AND($C$1=1,$C$2=2,C91=2),8,(IF(AND($C$1=1,$C$2=3,C91=2),9,(IF(AND($C$1=2,$C$2=1,C91=2),10,(IF(AND($C$1=2,$C$2=2,C91=2),11,(IF(AND($C$1=2,$C$2=3,C91=2),12,\"\")))))))))))))))))))))))","v":7},{"$f":"CHOOSE(H91,VLOOKUP(D91,DATA!$B$2:$N$25,2,FALSE),VLOOKUP(D91,DATA!$B$2:$N$25,3,FALSE),VLOOKUP(D91,DATA!$B$2:$N$25,4,FALSE),VLOOKUP(D91,DATA!$B$2:$N$25,5,FALSE),VLOOKUP(D91,DATA!$B$2:$N$25,6,FALSE),VLOOKUP(D91,DATA!$B$2:$N$25,7,FALSE),VLOOKUP(D91,DATA!$B$2:$N$25,8,FALSE),VLOOKUP(D91,DATA!$B$2:$N$25,9,FALSE),VLOOKUP(D91,DATA!$B$2:$N$25,10,FALSE),VLOOKUP(D91,DATA!$B$2:$N$25,11,FALSE),VLOOKUP(D91,DATA!$B$2:$N$25,12,FALSE),VLOOKUP(D91,DATA!$B$2:$N$25,13,FALSE),\"\")*(IF(F91=1,1,0))","v":0},{"$f":"CHOOSE(H91,VLOOKUP(D91,DATA!$B$27:$N$50,2,FALSE),VLOOKUP(D91,DATA!$B$27:$N$50,3,FALSE),VLOOKUP(D91,DATA!$B$27:$N$50,4,FALSE),VLOOKUP(D91,DATA!$B$27:$N$50,5,FALSE),VLOOKUP(D91,DATA!$B$27:$N$50,6,FALSE),VLOOKUP(D91,DATA!$B$27:$N$50,7,FALSE),VLOOKUP(D91,DATA!$B$27:$N$50,8,FALSE),VLOOKUP(D91,DATA!$B$27:$N$50,9,FALSE),VLOOKUP(D91,DATA!$B$27:$N$50,10,FALSE),VLOOKUP(D91,DATA!$B$27:$N$50,11,FALSE),VLOOKUP(D91,DATA!$B$27:$N$50,12,FALSE),VLOOKUP(D91,DATA!$B$27:$N$50,13,FALSE),\"\")*(IF(F92=1,1,0))","v":0},{"$f":"CHOOSE(H91,VLOOKUP(D91,DATA!$B$52:$N$75,2,FALSE),VLOOKUP(D91,DATA!$B$52:$N$75,3,FALSE),VLOOKUP(D91,DATA!$B$52:$N$75,4,FALSE),VLOOKUP(D91,DATA!$B$52:$N$77,5,FALSE),VLOOKUP(D91,DATA!$B$52:$N$75,6,FALSE),VLOOKUP(D91,DATA!$B$52:$N$75,7,FALSE),VLOOKUP(D91,DATA!$B$52:$N$75,8,FALSE),VLOOKUP(D91,DATA!$B$52:$N$75,9,FALSE),VLOOKUP(D91,DATA!$B$52:$N$75,10,FALSE),VLOOKUP(D91,DATA!$B$52:$N$75,11,FALSE),VLOOKUP(D91,DATA!$B$52:$N$75,12,FALSE),VLOOKUP(D91,DATA!$B$52:$N$75,13,FALSE),\"\")*(IF(F93=1,1,0))","v":0},{"$f":"CHOOSE(H91,VLOOKUP(D91,DATA!$B$77:$N$100,2,FALSE),VLOOKUP(D91,DATA!$B$77:$N$100,3,FALSE),VLOOKUP(D91,DATA!$B$77:$N$100,4,FALSE),VLOOKUP(D91,DATA!$B$77:$N$100,5,FALSE),VLOOKUP(D91,DATA!$B$77:$N$100,6,FALSE),VLOOKUP(D91,DATA!$B$77:$N$100,7,FALSE),VLOOKUP(D91,DATA!$B$77:$N$100,8,FALSE),VLOOKUP(D91,DATA!$B$77:$N$100,9,FALSE),VLOOKUP(D91,DATA!$B$77:$N$100,10,FALSE),VLOOKUP(D91,DATA!$B$77:$N$100,11,FALSE),VLOOKUP(D91,DATA!$B$77:$N$100,12,FALSE),VLOOKUP(D91,DATA!$B$77:$N$100,13,FALSE),\"\")*(IF(F94=1,1,0))","v":0},{"$f":"CHOOSE(H91,VLOOKUP(D91,DATA!$B$102:$N$125,2,FALSE),VLOOKUP(D91,DATA!$B$102:$N$125,3,FALSE),VLOOKUP(D91,DATA!$B$102:$N$125,4,FALSE),VLOOKUP(D91,DATA!$B$102:$N$125,5,FALSE),VLOOKUP(D91,DATA!$B$102:$N$125,6,FALSE),VLOOKUP(D91,DATA!$B$102:$N$125,7,FALSE),VLOOKUP(D91,DATA!$B$102:$N$125,8,FALSE),VLOOKUP(D91,DATA!$B$102:$N$125,9,FALSE),VLOOKUP(D91,DATA!$B$102:$N$125,10,FALSE),VLOOKUP(D91,DATA!$B$102:$N$125,11,FALSE),VLOOKUP(D91,DATA!$B$102:$N$125,12,FALSE),VLOOKUP(D91,DATA!$B$102:$N$125,13,FALSE),\"\")*(IF(F94=1,1,0))","v":0},{"$f":"利用申込書2!AG36","v":""},{"$f":"IF(AND(F92=1,F93=1,F94=1),\"午前-午後-夜間\",(IF(AND(F92=1,F93=1,F94=2),\"午前-午後\",(IF(AND(F92=2,F93=1,F94=1),\"午後-夜間\",(IF(AND(F92=1,F93=2,F94=2),\"午前\",(IF(AND(F92=2,F93=1,F94=2),\"午後\",IF(AND(F92=1,F93=2,F94=1),\"午前・夜間\",\"夜間\"))))))))))","v":"夜間"},null,{"$f":"IF(I91>0,VLOOKUP(O91,$A$235:$B$238,2,FALSE),VLOOKUP(O91,$A$226:$B$232,2,FALSE))","v":"18:00-21:00"},{"$f":"IF(B91=B87,\"\",B91)","v":""},{"$f":"B91","v":"00:00:00"},{"$f":"YEAR(S91)","v":1900},"年",{"$f":"T91&U91&T92&U92","v":"1900年1月"},{"$f":"IF(AND(F92=1,F93=1,F94=1),\"APN\",(IF(AND(F92=1,F93=1,F94=2),\"AP\",(IF(AND(F92=2,F93=1,F94=1),\"PN\",(IF(AND(F92=1,F93=2,F94=2),\"A\",(IF(AND(F92=2,F93=1,F94=2),\"P\",\"N\")))))))))","v":"N"},{"$f":"利用申込書1!$AV$50","v":""},{"$f":"X92&W91&\"・\"&AB91","v":"0N・"},{"$f":"T91&U91","v":"1900年"},null,{"$f":"CLEAN(X91)","v":""}]
[null,{"$f":"TEXT(B91,\"YYYY\")","v":"1900"},null,null,"チェック2",{"$f":"IF(F91=1,1,IF(G92,1,2))","v":2},false,null,null,{"$f":"B94&$J$6","v":"0A"},{"$f":"B94&$K$6","v":"0P"},{"$f":"B94&$L$6","v":"0N"},null,null,null,null,null,null,{"$f":"B91","v":"00:00:00"},{"$f":"MONTH(S91)","v":1},"月",{"$f":"T92&U92&T93&U93","v":"1月0日"},{"$f":"D91","v":0},{"$f":"LEFT(W92,3)","v":"0"}]
[null,{"$f":"TEXT(B91,\"YYYYmm\")","v":"190001"},null,null,"チェック3",2,false,null,null,{"$f":"G92","v":false},{"$f":"G93","v":false},{"$f":"G94","v":false},null,null,null,null,null,null,null,{"$f":"DAY(S91)","v":0},"日",{"$f":"T93&U93","v":"0日"}]
[null,{"$f":"TEXT(B91,\"d\")","v":"0"},null,null,"チェック4",2,false,null,null,null,null,null,null,null,null,null,null,null,null,null,null,{"$f":"T92&U92","v":"1月"}]
[{"$f":"IF(D95=\"大会議室(準備)\",\"大会議室\",(IF(D95=\"大会議室(本番)\",\"大会議室\",(IF(D95=\"ピアザホール(準備)\",\"PH\",IF(D95=\"ピアザホール(本番)\",\"PH\",IF(D95=\"練習室(一般)\",\"練習室\",IF(D95=\"練習室(学生)\",\"練習室\",D95))))))))","v":0},{"$f":"IF(利用申込書2!A38=\"\", B91,利用申込書2!A38)","v":"00:00:00"},{"$f":"IF(OR((WEEKDAY(B95,2)>=6),COUNTIF(DATA!$Q$3:$T$23,B95)),2,1)","v":2},{"$f":"利用申込書2!F38","v":0},"チェック1",2,false,{"$f":"IF(AND($C$1=1,$C$2=1,C95=1),1,(IF(AND($C$1=1,$C$2=2,C95=1),2,(IF(AND($C$1=1,$C$2=3,C95=1),3,(IF(AND($C$1=2,$C$2=1,C95=1),4,(IF(AND($C$1=2,$C$2=2,C95=1),5,(IF(AND($C$1=2,$C$2=3,C95=1),6,(IF(AND($C$1=1,$C$2=1,C95=2),7,(IF(AND($C$1=1,$C$2=2,C95=2),8,(IF(AND($C$1=1,$C$2=3,C95=2),9,(IF(AND($C$1=2,$C$2=1,C95=2),10,(IF(AND($C$1=2,$C$2=2,C95=2),11,(IF(AND($C$1=2,$C$2=3,C95=2),12,\"\")))))))))))))))))))))))","v":7},{"$f":"CHOOSE(H95,VLOOKUP(D95,DATA!$B$2:$N$25,2,FALSE),VLOOKUP(D95,DATA!$B$2:$N$25,3,FALSE),VLOOKUP(D95,DATA!$B$2:$N$25,4,FALSE),VLOOKUP(D95,DATA!$B$2:$N$25,5,FALSE),VLOOKUP(D95,DATA!$B$2:$N$25,6,FALSE),VLOOKUP(D95,DATA!$B$2:$N$25,7,FALSE),VLOOKUP(D95,DATA!$B$2:$N$25,8,FALSE),VLOOKUP(D95,DATA!$B$2:$N$25,9,FALSE),VLOOKUP(D95,DATA!$B$2:$N$25,10,FALSE),VLOOKUP(D95,DATA!$B$2:$N$25,11,FALSE),VLOOKUP(D95,DATA!$B$2:$N$25,12,FALSE),VLOOKUP(D95,DATA!$B$2:$N$25,13,FALSE),\"\")*(IF(F95=1,1,0))","v":0},{"$f":"CHOOSE(H95,VLOOKUP(D95,DATA!$B$27:$N$50,2,FALSE),VLOOKUP(D95,DATA!$B$27:$N$50,3,FALSE),VLOOKUP(D95,DATA!$B$27:$N$50,4,FALSE),VLOOKUP(D95,DATA!$B$27:$N$50,5,FALSE),VLOOKUP(D95,DATA!$B$27:$N$50,6,FALSE),VLOOKUP(D95,DATA!$B$27:$N$50,7,FALSE),VLOOKUP(D95,DATA!$B$27:$N$50,8,FALSE),VLOOKUP(D95,DATA!$B$27:$N$50,9,FALSE),VLOOKUP(D95,DATA!$B$27:$N$50,10,FALSE),VLOOKUP(D95,DATA!$B$27:$N$50,11,FALSE),VLOOKUP(D95,DATA!$B$27:$N$50,12,FALSE),VLOOKUP(D95,DATA!$B$27:$N$50,13,FALSE),\"\")*(IF(F96=1,1,0))","v":0},{"$f":"CHOOSE(H95,VLOOKUP(D95,DATA!$B$52:$N$75,2,FALSE),VLOOKUP(D95,DATA!$B$52:$N$75,3,FALSE),VLOOKUP(D95,DATA!$B$52:$N$75,4,FALSE),VLOOKUP(D95,DATA!$B$52:$N$77,5,FALSE),VLOOKUP(D95,DATA!$B$52:$N$75,6,FALSE),VLOOKUP(D95,DATA!$B$52:$N$75,7,FALSE),VLOOKUP(D95,DATA!$B$52:$N$75,8,FALSE),VLOOKUP(D95,DATA!$B$52:$N$75,9,FALSE),VLOOKUP(D95,DATA!$B$52:$N$75,10,FALSE),VLOOKUP(D95,DATA!$B$52:$N$75,11,FALSE),VLOOKUP(D95,DATA!$B$52:$N$75,12,FALSE),VLOOKUP(D95,DATA!$B$52:$N$75,13,FALSE),\"\")*(IF(F97=1,1,0))","v":0},{"$f":"CHOOSE(H95,VLOOKUP(D95,DATA!$B$77:$N$100,2,FALSE),VLOOKUP(D95,DATA!$B$77:$N$100,3,FALSE),VLOOKUP(D95,DATA!$B$77:$N$100,4,FALSE),VLOOKUP(D95,DATA!$B$77:$N$100,5,FALSE),VLOOKUP(D95,DATA!$B$77:$N$100,6,FALSE),VLOOKUP(D95,DATA!$B$77:$N$100,7,FALSE),VLOOKUP(D95,DATA!$B$77:$N$100,8,FALSE),VLOOKUP(D95,DATA!$B$77:$N$100,9,FALSE),VLOOKUP(D95,DATA!$B$77:$N$100,10,FALSE),VLOOKUP(D95,DATA!$B$77:$N$100,11,FALSE),VLOOKUP(D95,DATA!$B$77:$N$100,12,FALSE),VLOOKUP(D95,DATA!$B$77:$N$100,13,FALSE),\"\")*(IF(F98=1,1,0))","v":0},{"$f":"CHOOSE(H95,VLOOKUP(D95,DATA!$B$102:$N$125,2,FALSE),VLOOKUP(D95,DATA!$B$102:$N$125,3,FALSE),VLOOKUP(D95,DATA!$B$102:$N$125,4,FALSE),VLOOKUP(D95,DATA!$B$102:$N$125,5,FALSE),VLOOKUP(D95,DATA!$B$102:$N$125,6,FALSE),VLOOKUP(D95,DATA!$B$102:$N$125,7,FALSE),VLOOKUP(D95,DATA!$B$102:$N$125,8,FALSE),VLOOKUP(D95,DATA!$B$102:$N$125,9,FALSE),VLOOKUP(D95,DATA!$B$102:$N$125,10,FALSE),VLOOKUP(D95,DATA!$B$102:$N$125,11,FALSE),VLOOKUP(D95,DATA!$B$102:$N$125,12,FALSE),VLOOKUP(D95,DATA!$B$102:$N$125,13,FALSE),\"\")*(IF(F98=1,1,0))","v":0},{"$f":"利用申込書2!AG38","v":""},{"$f":"IF(AND(F96=1,F97=1,F98=1),\"午前-午後-夜間\",(IF(AND(F96=1,F97=1,F98=2),\"午前-午後\",(IF(AND(F96=2,F97=1,F98=1),\"午後-夜間\",(IF(AND(F96=1,F97=2,F98=2),\"午前\",(IF(AND(F96=2,F97=1,F98=2),\"午後\",IF(AND(F96=1,F97=2,F98=1),\"午前・夜間\",\"夜間\"))))))))))","v":"夜間"},null,{"$f":"IF(I95>0,VLOOKUP(O95,$A$235:$B$238,2,FALSE),VLOOKUP(O95,$A$226:$B$232,2,FALSE))","v":"18:00-21:00"},{"$f":"IF(B95=B91,\"\",B95)","v":""},{"$f":"B95","v":"00:00:00"},{"$f":"YEAR(S95)","v":1900},"年",{"$f":"T95&U95&T96&U96","v":"1900年1月"},{"$f":"IF(AND(F96=1,F97=1,F98=1),\"APN\",(IF(AND(F96=1,F97=1,F98=2),\"AP\",(IF(AND(F96=2,F97=1,F98=1),\"PN\",(IF(AND(F96=1,F97=2,F98=2),\"A\",(IF(AND(F96=2,F97=1,F98=2),\"P\",\"N\")))))))))","v":"N"},{"$f":"利用申込書1!$AV$50","v":""},{"$f":"X96&W95&\"・\"&AB95","v":"0N・"},{"$f":"T95&U95","v":"1900年"},null,{"$f":"CLEAN(X95)","v":""}]
[null,{"$f":"TEXT(B95,\"YYYY\")","v":"1900"},null,null,"チェック2",{"$f":"IF(F95=1,1,IF(G96,1,2))","v":2},false,null,null,{"$f":"B98&$J$6","v":"0A"},{"$f":"B98&$K$6","v":"0P"},{"$f":"B98&$L$6","v":"0N"},null,null,null,null,null,null,{"$f":"B95","v":"00:00:00"},{"$f":"MONTH(S95)","v":1},"月",{"$f":"T96&U96&T97&U97","v":"1月0日"},{"$f":"D95","v":0},{"$f":"LEFT(W96,3)","v":"0"}]
[null,{"$f":"TEXT(B95,\"YYYYmm\")","v":"190001"},null,null,"チェック3",2,false,null,null,{"$f":"G96","v":false},{"$f":"G97","v":false},{"$f":"G98","v":false},null,null,null,null,null,null,null,{"$f":"DAY(S95)","v":0},"日",{"$f":"T97&U97","v":"0日"}]
[null,{"$f":"TEXT(B95,\"d\")","v":"0"},null,null,"チェック4",2,false,null,null,null,null,null,null,null,null,null,null,null,null,null,null,{"$f":"T96&U96","v":"1月"}]
[{"$f":"IF(D99=\"大会議室(準備)\",\"大会議室\",(IF(D99=\"大会議室(本番)\",\"大会議室\",(IF(D99=\"ピアザホール(準備)\",\"PH\",IF(D99=\"ピアザホール(本番)\",\"PH\",IF(D99=\"練習室(一般)\",\"練習室\",IF(D99=\"練習室(学生)\",\"練習室\",D99))))))))","v":0},{"$f":"IF(利用申込書2!A40=\"\", B95,利用申込書2!A40)","v":"00:00:00"},{"$f":"IF(OR((WEEKDAY(B99,2)>=6),COUNTIF(DATA!$Q$3:$T$23,B99)),2,1)","v":2},{"$f":"利用申込書2!F40","v":0},"チェック1",2,false,{"$f":"IF(AND($C$1=1,$C$2=1,C99=1),1,(IF(AND($C$1=1,$C$2=2,C99=1),2,(IF(AND($C$1=1,$C$2=3,C99=1),3,(IF(AND($C$1=2,$C$2=1,C99=1),4,(IF(AND($C$1=2,$C$2=2,C99=1),5,(IF(AND($C$1=2,$C$2=3,C99=1),6,(IF(AND($C$1=1,$C$2=1,C99=2),7,(IF(AND($C$1=1,$C$2=2,C99=2),8,(IF(AND($C$1=1,$C$2=3,C99=2),9,(IF(AND($C$1=2,$C$2=1,C99=2),10,(IF(AND($C$1=2,$C$2=2,C99=2),11,(IF(AND($C$1=2,$C$2=3,C99=2),12,\"\")))))))))))))))))))))))","v":7},{"$f":"CHOOSE(H99,VLOOKUP(D99,DATA!$B$2:$N$25,2,FALSE),VLOOKUP(D99,DATA!$B$2:$N$25,3,FALSE),VLOOKUP(D99,DATA!$B$2:$N$25,4,FALSE),VLOOKUP(D99,DATA!$B$2:$N$25,5,FALSE),VLOOKUP(D99,DATA!$B$2:$N$25,6,FALSE),VLOOKUP(D99,DATA!$B$2:$N$25,7,FALSE),VLOOKUP(D99,DATA!$B$2:$N$25,8,FALSE),VLOOKUP(D99,DATA!$B$2:$N$25,9,FALSE),VLOOKUP(D99,DATA!$B$2:$N$25,10,FALSE),VLOOKUP(D99,DATA!$B$2:$N$25,11,FALSE),VLOOKUP(D99,DATA!$B$2:$N$25,12,FALSE),VLOOKUP(D99,DATA!$B$2:$N$25,13,FALSE),\"\")*(IF(F99=1,1,0))","v":0},{"$f":"CHOOSE(H99,VLOOKUP(D99,DATA!$B$27:$N$50,2,FALSE),VLOOKUP(D99,DATA!$B$27:$N$50,3,FALSE),VLOOKUP(D99,DATA!$B$27:$N$50,4,FALSE),VLOOKUP(D99,DATA!$B$27:$N$50,5,FALSE),VLOOKUP(D99,DATA!$B$27:$N$50,6,FALSE),VLOOKUP(D99,DATA!$B$27:$N$50,7,FALSE),VLOOKUP(D99,DATA!$B$27:$N$50,8,FALSE),VLOOKUP(D99,DATA!$B$27:$N$50,9,FALSE),VLOOKUP(D99,DATA!$B$27:$N$50,10,FALSE),VLOOKUP(D99,DATA!$B$27:$N$50,11,FALSE),VLOOKUP(D99,DATA!$B$27:$N$50,12,FALSE),VLOOKUP(D99,DATA!$B$27:$N$50,13,FALSE),\"\")*(IF(F100=1,1,0))","v":0},{"$f":"CHOOSE(H99,VLOOKUP(D99,DATA!$B$52:$N$75,2,FALSE),VLOOKUP(D99,DATA!$B$52:$N$75,3,FALSE),VLOOKUP(D99,DATA!$B$52:$N$75,4,FALSE),VLOOKUP(D99,DATA!$B$52:$N$77,5,FALSE),VLOOKUP(D99,DATA!$B$52:$N$75,6,FALSE),VLOOKUP(D99,DATA!$B$52:$N$75,7,FALSE),VLOOKUP(D99,DATA!$B$52:$N$75,8,FALSE),VLOOKUP(D99,DATA!$B$52:$N$75,9,FALSE),VLOOKUP(D99,DATA!$B$52:$N$75,10,FALSE),VLOOKUP(D99,DATA!$B$52:$N$75,11,FALSE),VLOOKUP(D99,DATA!$B$52:$N$75,12,FALSE),VLOOKUP(D99,DATA!$B$52:$N$75,13,FALSE),\"\")*(IF(F101=1,1,0))","v":0},{"$f":"CHOOSE(H99,VLOOKUP(D99,DATA!$B$77:$N$100,2,FALSE),VLOOKUP(D99,DATA!$B$77:$N$100,3,FALSE),VLOOKUP(D99,DATA!$B$77:$N$100,4,FALSE),VLOOKUP(D99,DATA!$B$77:$N$100,5,FALSE),VLOOKUP(D99,DATA!$B$77:$N$100,6,FALSE),VLOOKUP(D99,DATA!$B$77:$N$100,7,FALSE),VLOOKUP(D99,DATA!$B$77:$N$100,8,FALSE),VLOOKUP(D99,DATA!$B$77:$N$100,9,FALSE),VLOOKUP(D99,DATA!$B$77:$N$100,10,FALSE),VLOOKUP(D99,DATA!$B$77:$N$100,11,FALSE),VLOOKUP(D99,DATA!$B$77:$N$100,12,FALSE),VLOOKUP(D99,DATA!$B$77:$N$100,13,FALSE),\"\")*(IF(F102=1,1,0))","v":0},{"$f":"CHOOSE(H99,VLOOKUP(D99,DATA!$B$102:$N$125,2,FALSE),VLOOKUP(D99,DATA!$B$102:$N$125,3,FALSE),VLOOKUP(D99,DATA!$B$102:$N$125,4,FALSE),VLOOKUP(D99,DATA!$B$102:$N$125,5,FALSE),VLOOKUP(D99,DATA!$B$102:$N$125,6,FALSE),VLOOKUP(D99,DATA!$B$102:$N$125,7,FALSE),VLOOKUP(D99,DATA!$B$102:$N$125,8,FALSE),VLOOKUP(D99,DATA!$B$102:$N$125,9,FALSE),VLOOKUP(D99,DATA!$B$102:$N$125,10,FALSE),VLOOKUP(D99,DATA!$B$102:$N$125,11,FALSE),VLOOKUP(D99,DATA!$B$102:$N$125,12,FALSE),VLOOKUP(D99,DATA!$B$102:$N$125,13,FALSE),\"\")*(IF(F102=1,1,0))","v":0},{"$f":"利用申込書2!AG40","v":""},{"$f":"IF(AND(F100=1,F101=1,F102=1),\"午前-午後-夜間\",(IF(AND(F100=1,F101=1,F102=2),\"午前-午後\",(IF(AND(F100=2,F101=1,F102=1),\"午後-夜間\",(IF(AND(F100=1,F101=2,F102=2),\"午前\",(IF(AND(F100=2,F101=1,F102=2),\"午後\",IF(AND(F100=1,F101=2,F102=1),\"午前・夜間\",\"夜間\"))))))))))","v":"夜間"},null,{"$f":"IF(I99>0,VLOOKUP(O99,$A$235:$B$238,2,FALSE),VLOOKUP(O99,$A$226:$B$232,2,FALSE))","v":"18:00-21:00"},{"$f":"IF(B99=B95,\"\",B99)","v":""},{"$f":"B99","v":"00:00:00"},{"$f":"YEAR(S99)","v":1900},"年",{"$f":"T99&U99&T100&U100","v":"1900年1月"},{"$f":"IF(AND(F100=1,F101=1,F102=1),\"APN\",(IF(AND(F100=1,F101=1,F102=2),\"AP\",(IF(AND(F100=2,F101=1,F102=1),\"PN\",(IF(AND(F100=1,F101=2,F102=2),\"A\",(IF(AND(F100=2,F101=1,F102=2),\"P\",\"N\")))))))))","v":"N"},{"$f":"利用申込書1!$AV$50","v":""},{"$f":"X100&W99&\"・\"&AB99","v":"0N・"},{"$f":"T99&U99","v":"1900年"},null,{"$f":"CLEAN(X99)","v":""}]
[null,{"$f":"TEXT(B99,\"YYYY\")","v":"1900"},null,null,"チェック2",{"$f":"IF(F99=1,1,IF(G100,1,2))","v":2},false,null,null,{"$f":"B102&$J$6","v":"0A"},{"$f":"B102&$K$6","v":"0P"},{"$f":"B102&$L$6","v":"0N"},null,null,null,null,null,null,{"$f":"B99","v":"00:00:00"},{"$f":"MONTH(S99)","v":1},"月",{"$f":"T100&U100&T101&U101","v":"1月0日"},{"$f":"D99","v":0},{"$f":"LEFT(W100,3)","v":"0"}]
[null,{"$f":"TEXT(B99,\"YYYYmm\")","v":"190001"},null,null,"チェック3",2,false,null,null,{"$f":"G100","v":false},{"$f":"G101","v":false},{"$f":"G102","v":false},null,null,null,null,null,null,null,{"$f":"DAY(S99)","v":0},"日",{"$f":"T101&U101","v":"0日"}]
[null,{"$f":"TEXT(B99,\"d\")","v":"0"},null,null,"チェック4",2,false,null,null,null,null,null,null,null,null,null,null,null,null,null,null,{"$f":"T100&U100","v":"1月"}]
[{"$f":"IF(D103=\"大会議室(準備)\",\"大会議室\",(IF(D103=\"大会議室(本番)\",\"大会議室\",(IF(D103=\"ピアザホール(準備)\",\"PH\",IF(D103=\"ピアザホール(本番)\",\"PH\",IF(D103=\"練習室(一般)\",\"練習室\",IF(D103=\"練習室(学生)\",\"練習室\",D103))))))))","v":0},{"$f":"IF(利用申込書2!A42=\"\",B99,利用申込書2!A42)","v":"00:00:00"},{"$f":"IF(OR((WEEKDAY(B103,2)>=6),COUNTIF(DATA!$Q$3:$T$23,B103)),2,1)","v":2},{"$f":"利用申込書2!F42","v":0},"チェック1",2,false,{"$f":"IF(AND($C$1=1,$C$2=1,C103=1),1,(IF(AND($C$1=1,$C$2=2,C103=1),2,(IF(AND($C$1=1,$C$2=3,C103=1),3,(IF(AND($C$1=2,$C$2=1,C103=1),4,(IF(AND($C$1=2,$C$2=2,C103=1),5,(IF(AND($C$1=2,$C$2=3,C103=1),6,(IF(AND($C$1=1,$C$2=1,C103=2),7,(IF(AND($C$1=1,$C$2=2,C103=2),8,(IF(AND($C$1=1,$C$2=3,C103=2),9,(IF(AND($C$1=2,$C$2=1,C103=2),10,(IF(AND($C$1=2,$C$2=2,C103=2),11,(IF(AND($C$1=2,$C$2=3,C103=2),12,\"\")))))))))))))))))))))))","v":7},{"$f":"CHOOSE(H103,VLOOKUP(D103,DATA!$B$2:$N$25,2,FALSE),VLOOKUP(D103,DATA!$B$2:$N$25,3,FALSE),VLOOKUP(D103,DATA!$B$2:$N$25,4,FALSE),VLOOKUP(D103,DATA!$B$2:$N$25,5,FALSE),VLOOKUP(D103,DATA!$B$2:$N$25,6,FALSE),VLOOKUP(D103,DATA!$B$2:$N$25,7,FALSE),VLOOKUP(D103,DATA!$B$2:$N$25,8,FALSE),VLOOKUP(D103,DATA!$B$2:$N$25,9,FALSE),VLOOKUP(D103,DATA!$B$2:$N$25,10,FALSE),VLOOKUP(D103,DATA!$B$2:$N$25,11,FALSE),VLOOKUP(D103,DATA!$B$2:$N$25,12,FALSE),VLOOKUP(D103,DATA!$B$2:$N$25,13,FALSE),\"\")*(IF(F103=1,1,0))","v":0},{"$f":"CHOOSE(H103,VLOOKUP(D103,DATA!$B$27:$N$50,2,FALSE),VLOOKUP(D103,DATA!$B$27:$N$50,3,FALSE),VLOOKUP(D103,DATA!$B$27:$N$50,4,FALSE),VLOOKUP(D103,DATA!$B$27:$N$50,5,FALSE),VLOOKUP(D103,DATA!$B$27:$N$50,6,FALSE),VLOOKUP(D103,DATA!$B$27:$N$50,7,FALSE),VLOOKUP(D103,DATA!$B$27:$N$50,8,FALSE),VLOOKUP(D103,DATA!$B$27:$N$50,9,FALSE),VLOOKUP(D103,DATA!$B$27:$N$50,10,FALSE),VLOOKUP(D103,DATA!$B$27:$N$50,11,FALSE),VLOOKUP(D103,DATA!$B$27:$N$50,12,FALSE),VLOOKUP(D103,DATA!$B$27:$N$50,13,FALSE),\"\")*(IF(F104=1,1,0))","v":0},{"$f":"CHOOSE(H103,VLOOKUP(D103,DATA!$B$52:$N$75,2,FALSE),VLOOKUP(D103,DATA!$B$52:$N$75,3,FALSE),VLOOKUP(D103,DATA!$B$52:$N$75,4,FALSE),VLOOKUP(D103,DATA!$B$52:$N$77,5,FALSE),VLOOKUP(D103,DATA!$B$52:$N$75,6,FALSE),VLOOKUP(D103,DATA!$B$52:$N$75,7,FALSE),VLOOKUP(D103,DATA!$B$52:$N$75,8,FALSE),VLOOKUP(D103,DATA!$B$52:$N$75,9,FALSE),VLOOKUP(D103,DATA!$B$52:$N$75,10,FALSE),VLOOKUP(D103,DATA!$B$52:$N$75,11,FALSE),VLOOKUP(D103,DATA!$B$52:$N$75,12,FALSE),VLOOKUP(D103,DATA!$B$52:$N$75,13,FALSE),\"\")*(IF(F105=1,1,0))","v":0},{"$f":"CHOOSE(H103,VLOOKUP(D103,DATA!$B$77:$N$100,2,FALSE),VLOOKUP(D103,DATA!$B$77:$N$100,3,FALSE),VLOOKUP(D103,DATA!$B$77:$N$100,4,FALSE),VLOOKUP(D103,DATA!$B$77:$N$100,5,FALSE),VLOOKUP(D103,DATA!$B$77:$N$100,6,FALSE),VLOOKUP(D103,DATA!$B$77:$N$100,7,FALSE),VLOOKUP(D103,DATA!$B$77:$N$100,8,FALSE),VLOOKUP(D103,DATA!$B$77:$N$100,9,FALSE),VLOOKUP(D103,DATA!$B$77:$N$100,10,FALSE),VLOOKUP(D103,DATA!$B$77:$N$100,11,FALSE),VLOOKUP(D103,DATA!$B$77:$N$100,12,FALSE),VLOOKUP(D103,DATA!$B$77:$N$100,13,FALSE),\"\")*(IF(F106=1,1,0))","v":0},{"$f":"CHOOSE(H103,VLOOKUP(D103,DATA!$B$102:$N$125,2,FALSE),VLOOKUP(D103,DATA!$B$102:$N$125,3,FALSE),VLOOKUP(D103,DATA!$B$102:$N$125,4,FALSE),VLOOKUP(D103,DATA!$B$102:$N$125,5,FALSE),VLOOKUP(D103,DATA!$B$102:$N$125,6,FALSE),VLOOKUP(D103,DATA!$B$102:$N$125,7,FALSE),VLOOKUP(D103,DATA!$B$102:$N$125,8,FALSE),VLOOKUP(D103,DATA!$B$102:$N$125,9,FALSE),VLOOKUP(D103,DATA!$B$102:$N$125,10,FALSE),VLOOKUP(D103,DATA!$B$102:$N$125,11,FALSE),VLOOKUP(D103,DATA!$B$102:$N$125,12,FALSE),VLOOKUP(D103,DATA!$B$102:$N$125,13,FALSE),\"\")*(IF(F106=1,1,0))","v":0},{"$f":"利用申込書2!AG42","v":""},{"$f":"IF(AND(F104=1,F105=1,F106=1),\"午前-午後-夜間\",(IF(AND(F104=1,F105=1,F106=2),\"午前-午後\",(IF(AND(F104=2,F105=1,F106=1),\"午後-夜間\",(IF(AND(F104=1,F105=2,F106=2),\"午前\",(IF(AND(F104=2,F105=1,F106=2),\"午後\",IF(AND(F104=1,F105=2,F106=1),\"午前・夜間\",\"夜間\"))))))))))","v":"夜間"},null,{"$f":"IF(I103>0,VLOOKUP(O103,$A$235:$B$238,2,FALSE),VLOOKUP(O103,$A$226:$B$232,2,FALSE))","v":"18:00-21:00"},{"$f":"IF(B103=B99,\"\",B103)","v":""},{"$f":"B103","v":"00:00:00"},{"$f":"YEAR(S103)","v":1900},"年",{"$f":"T103&U103&T104&U104","v":"1900年1月"},{"$f":"IF(AND(F104=1,F105=1,F106=1),\"APN\",(IF(AND(F104=1,F105=1,F106=2),\"AP\",(IF(AND(F104=2,F105=1,F106=1),\"PN\",(IF(AND(F104=1,F105=2,F106=2),\"A\",(IF(AND(F104=2,F105=1,F106=2),\"P\",\"N\")))))))))","v":"N"},{"$f":"利用申込書1!$AV$50","v":""},{"$f":"X104&W103&\"・\"&AB103","v":"0N・"},{"$f":"T103&U103","v":"1900年"},null,{"$f":"CLEAN(X103)","v":""}]
[null,{"$f":"TEXT(B103,\"YYYY\")","v":"1900"},null,null,"チェック2",{"$f":"IF(F103=1,1,IF(G104,1,2))","v":2},false,null,null,{"$f":"B106&$J$6","v":"0A"},{"$f":"B106&$K$6","v":"0P"},{"$f":"B106&$L$6","v":"0N"},null,null,null,null,null,null,{"$f":"B103","v":"00:00:00"},{"$f":"MONTH(S103)","v":1},"月",{"$f":"T104&U104&T105&U105","v":"1月0日"},{"$f":"D103","v":0},{"$f":"LEFT(W104,3)","v":"0"}]
[null,{"$f":"TEXT(B103,\"YYYYmm\")","v":"190001"},null,null,"チェック3",{"$f":"IF(G105,1,2)","v":2},false,null,null,{"$f":"G104","v":false},{"$f":"G105","v":false},{"$f":"G106","v":false},null,null,null,null,null,null,null,{"$f":"DAY(S103)","v":0},"日",{"$f":"T105&U105","v":"0日"}]
[null,{"$f":"TEXT(B103,\"d\")","v":"0"},null,null,"チェック4",2,false,null,null,null,null,null,null,null,null,null,null,null,null,null,null,{"$f":"T104&U104","v":"1月"}]
[{"$f":"IF(D107=\"大会議室(準備)\",\"大会議室\",(IF(D107=\"大会議室(本番)\",\"大会議室\",(IF(D107=\"ピアザホール(準備)\",\"PH\",IF(D107=\"ピアザホール(本番)\",\"PH\",IF(D107=\"練習室(一般)\",\"練習室\",IF(D107=\"練習室(学生)\",\"練習室\",D107))))))))","v":0},{"$f":"IF(利用申込書2!A44=\"\", B103,利用申込書2!A44)","v":"00:00:00"},{"$f":"IF(OR((WEEKDAY(B107,2)>=6),COUNTIF(DATA!$Q$3:$T$23,B107)),2,1)","v":2},{"$f":"利用申込書2!F44","v":0},"チェック1",2,false,{"$f":"IF(AND($C$1=1,$C$2=1,C107=1),1,(IF(AND($C$1=1,$C$2=2,C107=1),2,(IF(AND($C$1=1,$C$2=3,C107=1),3,(IF(AND($C$1=2,$C$2=1,C107=1),4,(IF(AND($C$1=2,$C$2=2,C107=1),5,(IF(AND($C$1=2,$C$2=3,C107=1),6,(IF(AND($C$1=1,$C$2=1,C107=2),7,(IF(AND($C$1=1,$C$2=2,C107=2),8,(IF(AND($C$1=1,$C$2=3,C107=2),9,(IF(AND($C$1=2,$C$2=1,C107=2),10,(IF(AND($C$1=2,$C$2=2,C107=2),11,(IF(AND($C$1=2,$C$2=3,C107=2),12,\"\")))))))))))))))))))))))","v":7},{"$f":"CHOOSE(H107,VLOOKUP(D107,DATA!$B$2:$N$25,2,FALSE),VLOOKUP(D107,DATA!$B$2:$N$25,3,FALSE),VLOOKUP(D107,DATA!$B$2:$N$25,4,FALSE),VLOOKUP(D107,DATA!$B$2:$N$25,5,FALSE),VLOOKUP(D107,DATA!$B$2:$N$25,6,FALSE),VLOOKUP(D107,DATA!$B$2:$N$25,7,FALSE),VLOOKUP(D107,DATA!$B$2:$N$25,8,FALSE),VLOOKUP(D107,DATA!$B$2:$N$25,9,FALSE),VLOOKUP(D107,DATA!$B$2:$N$25,10,FALSE),VLOOKUP(D107,DATA!$B$2:$N$25,11,FALSE),VLOOKUP(D107,DATA!$B$2:$N$25,12,FALSE),VLOOKUP(D107,DATA!$B$2:$N$25,13,FALSE),\"\")*(IF(F107=1,1,0))","v":0},{"$f":"CHOOSE(H107,VLOOKUP(D107,DATA!$B$27:$N$50,2,FALSE),VLOOKUP(D107,DATA!$B$27:$N$50,3,FALSE),VLOOKUP(D107,DATA!$B$27:$N$50,4,FALSE),VLOOKUP(D107,DATA!$B$27:$N$50,5,FALSE),VLOOKUP(D107,DATA!$B$27:$N$50,6,FALSE),VLOOKUP(D107,DATA!$B$27:$N$50,7,FALSE),VLOOKUP(D107,DATA!$B$27:$N$50,8,FALSE),VLOOKUP(D107,DATA!$B$27:$N$50,9,FALSE),VLOOKUP(D107,DATA!$B$27:$N$50,10,FALSE),VLOOKUP(D107,DATA!$B$27:$N$50,11,FALSE),VLOOKUP(D107,DATA!$B$27:$N$50,12,FALSE),VLOOKUP(D107,DATA!$B$27:$N$50,13,FALSE),\"\")*(IF(F108=1,1,0))","v":0},{"$f":"CHOOSE(H107,VLOOKUP(D107,DATA!$B$52:$N$75,2,FALSE),VLOOKUP(D107,DATA!$B$52:$N$75,3,FALSE),VLOOKUP(D107,DATA!$B$52:$N$75,4,FALSE),VLOOKUP(D107,DATA!$B$52:$N$77,5,FALSE),VLOOKUP(D107,DATA!$B$52:$N$75,6,FALSE),VLOOKUP(D107,DATA!$B$52:$N$75,7,FALSE),VLOOKUP(D107,DATA!$B$52:$N$75,8,FALSE),VLOOKUP(D107,DATA!$B$52:$N$75,9,FALSE),VLOOKUP(D107,DATA!$B$52:$N$75,10,FALSE),VLOOKUP(D107,DATA!$B$52:$N$75,11,FALSE),VLOOKUP(D107,DATA!$B$52:$N$75,12,FALSE),VLOOKUP(D107,DATA!$B$52:$N$75,13,FALSE),\"\")*(IF(F109=1,1,0))","v":0},{"$f":"CHOOSE(H107,VLOOKUP(D107,DATA!$B$77:$N$100,2,FALSE),VLOOKUP(D107,DATA!$B$77:$N$100,3,FALSE),VLOOKUP(D107,DATA!$B$77:$N$100,4,FALSE),VLOOKUP(D107,DATA!$B$77:$N$100,5,FALSE),VLOOKUP(D107,DATA!$B$77:$N$100,6,FALSE),VLOOKUP(D107,DATA!$B$77:$N$100,7,FALSE),VLOOKUP(D107,DATA!$B$77:$N$100,8,FALSE),VLOOKUP(D107,DATA!$B$77:$N$100,9,FALSE),VLOOKUP(D107,DATA!$B$77:$N$100,10,FALSE),VLOOKUP(D107,DATA!$B$77:$N$100,11,FALSE),VLOOKUP(D107,DATA!$B$77:$N$100,12,FALSE),VLOOKUP(D107,DATA!$B$77:$N$100,13,FALSE),\"\")*(IF(F110=1,1,0))","v":0},{"$f":"CHOOSE(H107,VLOOKUP(D107,DATA!$B$102:$N$125,2,FALSE),VLOOKUP(D107,DATA!$B$102:$N$125,3,FALSE),VLOOKUP(D107,DATA!$B$102:$N$125,4,FALSE),VLOOKUP(D107,DATA!$B$102:$N$125,5,FALSE),VLOOKUP(D107,DATA!$B$102:$N$125,6,FALSE),VLOOKUP(D107,DATA!$B$102:$N$125,7,FALSE),VLOOKUP(D107,DATA!$B$102:$N$125,8,FALSE),VLOOKUP(D107,DATA!$B$102:$N$125,9,FALSE),VLOOKUP(D107,DATA!$B$102:$N$125,10,FALSE),VLOOKUP(D107,DATA!$B$102:$N$125,11,FALSE),VLOOKUP(D107,DATA!$B$102:$N$125,12,FALSE),VLOOKUP(D107,DATA!$B$102:$N$125,13,FALSE),\"\")*(IF(F110=1,1,0))","v":0},{"$f":"利用申込書2!AG44","v":""},{"$f":"IF(AND(F108=1,F109=1,F110=1),\"午前-午後-夜間\",(IF(AND(F108=1,F109=1,F110=2),\"午前-午後\",(IF(AND(F108=2,F109=1,F110=1),\"午後-夜間\",(IF(AND(F108=1,F109=2,F110=2),\"午前\",(IF(AND(F108=2,F109=1,F110=2),\"午後\",IF(AND(F108=1,F109=2,F110=1),\"午前・夜間\",\"夜間\"))))))))))","v":"夜間"},null,{"$f":"IF(I107>0,VLOOKUP(O107,$A$235:$B$238,2,FALSE),VLOOKUP(O107,$A$226:$B$232,2,FALSE))","v":"18:00-21:00"},{"$f":"IF(B107=B103,\"\",B107)","v":""},{"$f":"B107","v":"00:00:00"},{"$f":"YEAR(S107)","v":1900},"年",{"$f":"T107&U107&T108&U108","v":"1900年1月"},{"$f":"IF(AND(F108=1,F109=1,F110=1),\"APN\",(IF(AND(F108=1,F109=1,F110=2),\"AP\",(IF(AND(F108=2,F109=1,F110=1),\"PN\",(IF(AND(F108=1,F109=2,F110=2),\"A\",(IF(AND(F108=2,F109=1,F110=2),\"P\",\"N\")))))))))","v":"N"},{"$f":"利用申込書1!$AV$50","v":""},{"$f":"X108&W107&\"・\"&AB107","v":"0N・"},{"$f":"T107&U107","v":"1900年"},null,{"$f":"CLEAN(X107)","v":""}]
[null,{"$f":"TEXT(B107,\"YYYY\")","v":"1900"},null,null,"チェック2",{"$f":"IF(F107=1,1,IF(G108,1,2))","v":2},false,null,null,{"$f":"B110&$J$6","v":"0A"},{"$f":"B110&$K$6","v":"0P"},{"$f":"B110&$L$6","v":"0N"},null,null,null,null,null,null,{"$f":"B107","v":"00:00:00"},{"$f":"MONTH(S107)","v":1},"月",{"$f":"T108&U108&T109&U109","v":"1月0日"},{"$f":"D107","v":0},{"$f":"LEFT(W108,3)","v":"0"}]
[null,{"$f":"TEXT(B107,\"YYYYmm\")","v":"190001"},null,null,"チェック3",2,false,null,null,{"$f":"G108","v":false},{"$f":"G109","v":false},{"$f":"G110","v":false},null,null,null,null,null,null,null,{"$f":"DAY(S107)","v":0},"日",{"$f":"T109&U109","v":"0日"}]
[null,{"$f":"TEXT(B107,\"d\")","v":"0"},null,null,"チェック4",2,false,null,null,null,null,null,null,null,null,null,null,null,null,null,null,{"$f":"T108&U108","v":"1月"}]
[{"$f":"IF(D111=\"大会議室(準備)\",\"大会議室\",(IF(D111=\"大会議室(本番)\",\"大会議室\",(IF(D111=\"ピアザホール(準備)\",\"PH\",IF(D111=\"ピアザホール(本番)\",\"PH\",IF(D111=\"練習室(一般)\",\"練習室\",IF(D111=\"練習室(学生)\",\"練習室\",D111))))))))","v":0},{"$f":"IF(利用申込書2!A46=\"\", B107,利用申込書2!A46)","v":"00:00:00"},{"$f":"IF(OR((WEEKDAY(B111,2)>=6),COUNTIF(DATA!$Q$3:$T$23,B111)),2,1)","v":2},{"$f":"利用申込書2!F46","v":0},"チェック1",2,false,{"$f":"IF(AND($C$1=1,$C$2=1,C111=1),1,(IF(AND($C$1=1,$C$2=2,C111=1),2,(IF(AND($C$1=1,$C$2=3,C111=1),3,(IF(AND($C$1=2,$C$2=1,C111=1),4,(IF(AND($C$1=2,$C$2=2,C111=1),5,(IF(AND($C$1=2,$C$2=3,C111=1),6,(IF(AND($C$1=1,$C$2=1,C111=2),7,(IF(AND($C$1=1,$C$2=2,C111=2),8,(IF(AND($C$1=1,$C$2=3,C111=2),9,(IF(AND($C$1=2,$C$2=1,C111=2),10,(IF(AND($C$1=2,$C$2=2,C111=2),11,(IF(AND($C$1=2,$C$2=3,C111=2),12,\"\")))))))))))))))))))))))","v":7},{"$f":"CHOOSE(H111,VLOOKUP(D111,DATA!$B$2:$N$25,2,FALSE),VLOOKUP(D111,DATA!$B$2:$N$25,3,FALSE),VLOOKUP(D111,DATA!$B$2:$N$25,4,FALSE),VLOOKUP(D111,DATA!$B$2:$N$25,5,FALSE),VLOOKUP(D111,DATA!$B$2:$N$25,6,FALSE),VLOOKUP(D111,DATA!$B$2:$N$25,7,FALSE),VLOOKUP(D111,DATA!$B$2:$N$25,8,FALSE),VLOOKUP(D111,DATA!$B$2:$N$25,9,FALSE),VLOOKUP(D111,DATA!$B$2:$N$25,10,FALSE),VLOOKUP(D111,DATA!$B$2:$N$25,11,FALSE),VLOOKUP(D111,DATA!$B$2:$N$25,12,FALSE),VLOOKUP(D111,DATA!$B$2:$N$25,13,FALSE),\"\")*(IF(F111=1,1,0))","v":0},{"$f":"CHOOSE(H111,VLOOKUP(D111,DATA!$B$27:$N$50,2,FALSE),VLOOKUP(D111,DATA!$B$27:$N$50,3,FALSE),VLOOKUP(D111,DATA!$B$27:$N$50,4,FALSE),VLOOKUP(D111,DATA!$B$27:$N$50,5,FALSE),VLOOKUP(D111,DATA!$B$27:$N$50,6,FALSE),VLOOKUP(D111,DATA!$B$27:$N$50,7,FALSE),VLOOKUP(D111,DATA!$B$27:$N$50,8,FALSE),VLOOKUP(D111,DATA!$B$27:$N$50,9,FALSE),VLOOKUP(D111,DATA!$B$27:$N$50,10,FALSE),VLOOKUP(D111,DATA!$B$27:$N$50,11,FALSE),VLOOKUP(D111,DATA!$B$27:$N$50,12,FALSE),VLOOKUP(D111,DATA!$B$27:$N$50,13,FALSE),\"\")*(IF(F112=1,1,0))","v":0},{"$f":"CHOOSE(H111,VLOOKUP(D111,DATA!$B$52:$N$75,2,FALSE),VLOOKUP(D111,DATA!$B$52:$N$75,3,FALSE),VLOOKUP(D111,DATA!$B$52:$N$75,4,FALSE),VLOOKUP(D111,DATA!$B$52:$N$77,5,FALSE),VLOOKUP(D111,DATA!$B$52:$N$75,6,FALSE),VLOOKUP(D111,DATA!$B$52:$N$75,7,FALSE),VLOOKUP(D111,DATA!$B$52:$N$75,8,FALSE),VLOOKUP(D111,DATA!$B$52:$N$75,9,FALSE),VLOOKUP(D111,DATA!$B$52:$N$75,10,FALSE),VLOOKUP(D111,DATA!$B$52:$N$75,11,FALSE),VLOOKUP(D111,DATA!$B$52:$N$75,12,FALSE),VLOOKUP(D111,DATA!$B$52:$N$75,13,FALSE),\"\")*(IF(F113=1,1,0))","v":0},{"$f":"CHOOSE(H111,VLOOKUP(D111,DATA!$B$77:$N$100,2,FALSE),VLOOKUP(D111,DATA!$B$77:$N$100,3,FALSE),VLOOKUP(D111,DATA!$B$77:$N$100,4,FALSE),VLOOKUP(D111,DATA!$B$77:$N$100,5,FALSE),VLOOKUP(D111,DATA!$B$77:$N$100,6,FALSE),VLOOKUP(D111,DATA!$B$77:$N$100,7,FALSE),VLOOKUP(D111,DATA!$B$77:$N$100,8,FALSE),VLOOKUP(D111,DATA!$B$77:$N$100,9,FALSE),VLOOKUP(D111,DATA!$B$77:$N$100,10,FALSE),VLOOKUP(D111,DATA!$B$77:$N$100,11,FALSE),VLOOKUP(D111,DATA!$B$77:$N$100,12,FALSE),VLOOKUP(D111,DATA!$B$77:$N$100,13,FALSE),\"\")*(IF(F114=1,1,0))","v":0},{"$f":"CHOOSE(H111,VLOOKUP(D111,DATA!$B$102:$N$125,2,FALSE),VLOOKUP(D111,DATA!$B$102:$N$125,3,FALSE),VLOOKUP(D111,DATA!$B$102:$N$125,4,FALSE),VLOOKUP(D111,DATA!$B$102:$N$125,5,FALSE),VLOOKUP(D111,DATA!$B$102:$N$125,6,FALSE),VLOOKUP(D111,DATA!$B$102:$N$125,7,FALSE),VLOOKUP(D111,DATA!$B$102:$N$125,8,FALSE),VLOOKUP(D111,DATA!$B$102:$N$125,9,FALSE),VLOOKUP(D111,DATA!$B$102:$N$125,10,FALSE),VLOOKUP(D111,DATA!$B$102:$N$125,11,FALSE),VLOOKUP(D111,DATA!$B$102:$N$125,12,FALSE),VLOOKUP(D111,DATA!$B$102:$N$125,13,FALSE),\"\")*(IF(F114=1,1,0))","v":0},{"$f":"利用申込書2!AG46","v":""},{"$f":"IF(AND(F112=1,F113=1,F114=1),\"午前-午後-夜間\",(IF(AND(F112=1,F113=1,F114=2),\"午前-午後\",(IF(AND(F112=2,F113=1,F114=1),\"午後-夜間\",(IF(AND(F112=1,F113=2,F114=2),\"午前\",(IF(AND(F112=2,F113=1,F114=2),\"午後\",IF(AND(F112=1,F113=2,F114=1),\"午前・夜間\",\"夜間\"))))))))))","v":"夜間"},null,{"$f":"IF(I111>0,VLOOKUP(O111,$A$235:$B$238,2,FALSE),VLOOKUP(O111,$A$226:$B$232,2,FALSE))","v":"18:00-21:00"},{"$f":"IF(B111=B107,\"\",B111)","v":""},{"$f":"B111","v":"00:00:00"},{"$f":"YEAR(S111)","v":1900},"年",{"$f":"T111&U111&T112&U112","v":"1900年1月"},{"$f":"IF(AND(F112=1,F113=1,F114=1),\"APN\",(IF(AND(F112=1,F113=1,F114=2),\"AP\",(IF(AND(F112=2,F113=1,F114=1),\"PN\",(IF(AND(F112=1,F113=2,F114=2),\"A\",(IF(AND(F112=2,F113=1,F114=2),\"P\",\"N\")))))))))","v":"N"},{"$f":"利用申込書1!$AV$50","v":""},{"$f":"X112&W111&\"・\"&AB111","v":"0N・"},{"$f":"T111&U111","v":"1900年"},null,{"$f":"CLEAN(X111)","v":""}]
[null,{"$f":"TEXT(B111,\"YYYY\")","v":"1900"},null,null,"チェック2",{"$f":"IF(F111=1,1,IF(G112,1,2))","v":2},false,null,null,{"$f":"B114&$J$6","v":"0A"},{"$f":"B114&$K$6","v":"0P"},{"$f":"B114&$L$6","v":"0N"},null,null,null,null,null,null,{"$f":"B111","v":"00:00:00"},{"$f":"MONTH(S111)","v":1},"月",{"$f":"T112&U112&T113&U113","v":"1月0日"},{"$f":"D111","v":0},{"$f":"LEFT(W112,3)","v":"0"}]
[null,{"$f":"TEXT(B111,\"YYYYmm\")","v":"190001"},null,null,"チェック3",2,false,null,null,{"$f":"G112","v":false},{"$f":"G113","v":false},{"$f":"G114","v":false},null,null,null,null,null,null,null,{"$f":"DAY(S111)","v":0},"日",{"$f":"T113&U113","v":"0日"}]
[null,{"$f":"TEXT(B111,\"d\")","v":"0"},null,null,"チェック4",2,false,null,null,null,null,null,null,null,null,null,null,null,null,null,null,{"$f":"T112&U112","v":"1月"}]
[{"$f":"IF(D115=\"大会議室(準備)\",\"大会議室\",(IF(D115=\"大会議室(本番)\",\"大会議室\",(IF(D115=\"ピアザホール(準備)\",\"PH\",IF(D115=\"ピアザホール(本番)\",\"PH\",IF(D115=\"練習室(一般)\",\"練習室\",IF(D115=\"練習室(学生)\",\"練習室\",D115))))))))","v":0},{"$f":"IF(利用申込書2!A48=\"\", B111,利用申込書2!A48)","v":"00:00:00"},{"$f":"IF(OR((WEEKDAY(B115,2)>=6),COUNTIF(DATA!$Q$3:$T$23,B115)),2,1)","v":2},{"$f":"利用申込書2!F48","v":0},"チェック1",2,false,{"$f":"IF(AND($C$1=1,$C$2=1,C115=1),1,(IF(AND($C$1=1,$C$2=2,C115=1),2,(IF(AND($C$1=1,$C$2=3,C115=1),3,(IF(AND($C$1=2,$C$2=1,C115=1),4,(IF(AND($C$1=2,$C$2=2,C115=1),5,(IF(AND($C$1=2,$C$2=3,C115=1),6,(IF(AND($C$1=1,$C$2=1,C115=2),7,(IF(AND($C$1=1,$C$2=2,C115=2),8,(IF(AND($C$1=1,$C$2=3,C115=2),9,(IF(AND($C$1=2,$C$2=1,C115=2),10,(IF(AND($C$1=2,$C$2=2,C115=2),11,(IF(AND($C$1=2,$C$2=3,C115=2),12,\"\")))))))))))))))))))))))","v":7},{"$f":"CHOOSE(H115,VLOOKUP(D115,DATA!$B$2:$N$25,2,FALSE),VLOOKUP(D115,DATA!$B$2:$N$25,3,FALSE),VLOOKUP(D115,DATA!$B$2:$N$25,4,FALSE),VLOOKUP(D115,DATA!$B$2:$N$25,5,FALSE),VLOOKUP(D115,DATA!$B$2:$N$25,6,FALSE),VLOOKUP(D115,DATA!$B$2:$N$25,7,FALSE),VLOOKUP(D115,DATA!$B$2:$N$25,8,FALSE),VLOOKUP(D115,DATA!$B$2:$N$25,9,FALSE),VLOOKUP(D115,DATA!$B$2:$N$25,10,FALSE),VLOOKUP(D115,DATA!$B$2:$N$25,11,FALSE),VLOOKUP(D115,DATA!$B$2:$N$25,12,FALSE),VLOOKUP(D115,DATA!$B$2:$N$25,13,FALSE),\"\")*(IF(F115=1,1,0))","v":0},{"$f":"CHOOSE(H115,VLOOKUP(D115,DATA!$B$27:$N$50,2,FALSE),VLOOKUP(D115,DATA!$B$27:$N$50,3,FALSE),VLOOKUP(D115,DATA!$B$27:$N$50,4,FALSE),VLOOKUP(D115,DATA!$B$27:$N$50,5,FALSE),VLOOKUP(D115,DATA!$B$27:$N$50,6,FALSE),VLOOKUP(D115,DATA!$B$27:$N$50,7,FALSE),VLOOKUP(D115,DATA!$B$27:$N$50,8,FALSE),VLOOKUP(D115,DATA!$B$27:$N$50,9,FALSE),VLOOKUP(D115,DATA!$B$27:$N$50,10,FALSE),VLOOKUP(D115,DATA!$B$27:$N$50,11,FALSE),VLOOKUP(D115,DATA!$B$27:$N$50,12,FALSE),VLOOKUP(D115,DATA!$B$27:$N$50,13,FALSE),\"\")*(IF(F116=1,1,0))","v":0},{"$f":"CHOOSE(H115,VLOOKUP(D115,DATA!$B$52:$N$75,2,FALSE),VLOOKUP(D115,DATA!$B$52:$N$75,3,FALSE),VLOOKUP(D115,DATA!$B$52:$N$75,4,FALSE),VLOOKUP(D115,DATA!$B$52:$N$77,5,FALSE),VLOOKUP(D115,DATA!$B$52:$N$75,6,FALSE),VLOOKUP(D115,DATA!$B$52:$N$75,7,FALSE),VLOOKUP(D115,DATA!$B$52:$N$75,8,FALSE),VLOOKUP(D115,DATA!$B$52:$N$75,9,FALSE),VLOOKUP(D115,DATA!$B$52:$N$75,10,FALSE),VLOOKUP(D115,DATA!$B$52:$N$75,11,FALSE),VLOOKUP(D115,DATA!$B$52:$N$75,12,FALSE),VLOOKUP(D115,DATA!$B$52:$N$75,13,FALSE),\"\")*(IF(F117=1,1,0))","v":0},{"$f":"CHOOSE(H115,VLOOKUP(D115,DATA!$B$77:$N$100,2,FALSE),VLOOKUP(D115,DATA!$B$77:$N$100,3,FALSE),VLOOKUP(D115,DATA!$B$77:$N$100,4,FALSE),VLOOKUP(D115,DATA!$B$77:$N$100,5,FALSE),VLOOKUP(D115,DATA!$B$77:$N$100,6,FALSE),VLOOKUP(D115,DATA!$B$77:$N$100,7,FALSE),VLOOKUP(D115,DATA!$B$77:$N$100,8,FALSE),VLOOKUP(D115,DATA!$B$77:$N$100,9,FALSE),VLOOKUP(D115,DATA!$B$77:$N$100,10,FALSE),VLOOKUP(D115,DATA!$B$77:$N$100,11,FALSE),VLOOKUP(D115,DATA!$B$77:$N$100,12,FALSE),VLOOKUP(D115,DATA!$B$77:$N$100,13,FALSE),\"\")*(IF(F118=1,1,0))","v":0},{"$f":"CHOOSE(H115,VLOOKUP(D115,DATA!$B$102:$N$125,2,FALSE),VLOOKUP(D115,DATA!$B$102:$N$125,3,FALSE),VLOOKUP(D115,DATA!$B$102:$N$125,4,FALSE),VLOOKUP(D115,DATA!$B$102:$N$125,5,FALSE),VLOOKUP(D115,DATA!$B$102:$N$125,6,FALSE),VLOOKUP(D115,DATA!$B$102:$N$125,7,FALSE),VLOOKUP(D115,DATA!$B$102:$N$125,8,FALSE),VLOOKUP(D115,DATA!$B$102:$N$125,9,FALSE),VLOOKUP(D115,DATA!$B$102:$N$125,10,FALSE),VLOOKUP(D115,DATA!$B$102:$N$125,11,FALSE),VLOOKUP(D115,DATA!$B$102:$N$125,12,FALSE),VLOOKUP(D115,DATA!$B$102:$N$125,13,FALSE),\"\")*(IF(F118=1,1,0))","v":0},{"$f":"利用申込書2!AG48","v":""},{"$f":"IF(AND(F116=1,F117=1,F118=1),\"午前-午後-夜間\",(IF(AND(F116=1,F117=1,F118=2),\"午前-午後\",(IF(AND(F116=2,F117=1,F118=1),\"午後-夜間\",(IF(AND(F116=1,F117=2,F118=2),\"午前\",(IF(AND(F116=2,F117=1,F118=2),\"午後\",IF(AND(F116=1,F117=2,F118=1),\"午前・夜間\",\"夜間\"))))))))))","v":"夜間"},null,{"$f":"IF(I115>0,VLOOKUP(O115,$A$235:$B$238,2,FALSE),VLOOKUP(O115,$A$226:$B$232,2,FALSE))","v":"18:00-21:00"},{"$f":"IF(B115=B111,\"\",B115)","v":""},{"$f":"B115","v":"00:00:00"},{"$f":"YEAR(S115)","v":1900},"年",{"$f":"T115&U115&T116&U116","v":"1900年1月"},{"$f":"IF(AND(F116=1,F117=1,F118=1),\"APN\",(IF(AND(F116=1,F117=1,F118=2),\"AP\",(IF(AND(F116=2,F117=1,F118=1),\"PN\",(IF(AND(F116=1,F117=2,F118=2),\"A\",(IF(AND(F116=2,F117=1,F118=2),\"P\",\"N\")))))))))","v":"N"},{"$f":"利用申込書1!$AV$50","v":""},{"$f":"X116&W115&\"・\"&AB115","v":"0N・"},{"$f":"T115&U115","v":"1900年"},null,{"$f":"CLEAN(X115)","v":""}]
[null,{"$f":"TEXT(B115,\"YYYY\")","v":"1900"},null,null,"チェック2",{"$f":"IF(F115=1,1,IF(G116,1,2))","v":2},false,null,null,{"$f":"B118&$J$6","v":"0A"},{"$f":"B118&$K$6","v":"0P"},{"$f":"B118&$L$6","v":"0N"},null,null,null,null,null,null,{"$f":"B115","v":"00:00:00"},{"$f":"MONTH(S115)","v":1},"月",{"$f":"T116&U116&T117&U117","v":"1月0日"},{"$f":"D115","v":0},{"$f":"LEFT(W116,3)","v":"0"}]
[null,{"$f":"TEXT(B115,\"YYYYmm\")","v":"190001"},null,null,"チェック3",2,false,null,null,{"$f":"G116","v":false},{"$f":"G117","v":false},{"$f":"G118","v":false},null,null,null,null,null,null,null,{"$f":"DAY(S115)","v":0},"日",{"$f":"T117&U117","v":"0日"}]
[null,{"$f":"TEXT(B115,\"d\")","v":"0"},null,null,"チェック4",2,false,null,null,null,null,null,null,null,null,null,null,null,null,null,null,{"$f":"T116&U116","v":"1月"}]
[{"$f":"IF(D119=\"大会議室(準備)\",\"大会議室\",(IF(D119=\"大会議室(本番)\",\"大会議室\",(IF(D119=\"ピアザホール(準備)\",\"PH\",IF(D119=\"ピアザホール(本番)\",\"PH\",IF(D119=\"練習室(一般)\",\"練習室\",IF(D119=\"練習室(学生)\",\"練習室\",D119))))))))","v":0},{"$f":"IF(利用申込書2!A50=\"\", B115,利用申込書2!A50)","v":"00:00:00"},{"$f":"IF(OR((WEEKDAY(B119,2)>=6),COUNTIF(DATA!$Q$3:$T$23,B119)),2,1)","v":2},{"$f":"利用申込書2!F50","v":0},"チェック1",2,false,{"$f":"IF(AND($C$1=1,$C$2=1,C119=1),1,(IF(AND($C$1=1,$C$2=2,C119=1),2,(IF(AND($C$1=1,$C$2=3,C119=1),3,(IF(AND($C$1=2,$C$2=1,C119=1),4,(IF(AND($C$1=2,$C$2=2,C119=1),5,(IF(AND($C$1=2,$C$2=3,C119=1),6,(IF(AND($C$1=1,$C$2=1,C119=2),7,(IF(AND($C$1=1,$C$2=2,C119=2),8,(IF(AND($C$1=1,$C$2=3,C119=2),9,(IF(AND($C$1=2,$C$2=1,C119=2),10,(IF(AND($C$1=2,$C$2=2,C119=2),11,(IF(AND($C$1=2,$C$2=3,C119=2),12,\"\")))))))))))))))))))))))","v":7},{"$f":"CHOOSE(H119,VLOOKUP(D119,DATA!$B$2:$N$25,2,FALSE),VLOOKUP(D119,DATA!$B$2:$N$25,3,FALSE),VLOOKUP(D119,DATA!$B$2:$N$25,4,FALSE),VLOOKUP(D119,DATA!$B$2:$N$25,5,FALSE),VLOOKUP(D119,DATA!$B$2:$N$25,6,FALSE),VLOOKUP(D119,DATA!$B$2:$N$25,7,FALSE),VLOOKUP(D119,DATA!$B$2:$N$25,8,FALSE),VLOOKUP(D119,DATA!$B$2:$N$25,9,FALSE),VLOOKUP(D119,DATA!$B$2:$N$25,10,FALSE),VLOOKUP(D119,DATA!$B$2:$N$25,11,FALSE),VLOOKUP(D119,DATA!$B$2:$N$25,12,FALSE),VLOOKUP(D119,DATA!$B$2:$N$25,13,FALSE),\"\")*(IF(F119=1,1,0))","v":0},{"$f":"CHOOSE(H119,VLOOKUP(D119,DATA!$B$27:$N$50,2,FALSE),VLOOKUP(D119,DATA!$B$27:$N$50,3,FALSE),VLOOKUP(D119,DATA!$B$27:$N$50,4,FALSE),VLOOKUP(D119,DATA!$B$27:$N$50,5,FALSE),VLOOKUP(D119,DATA!$B$27:$N$50,6,FALSE),VLOOKUP(D119,DATA!$B$27:$N$50,7,FALSE),VLOOKUP(D119,DATA!$B$27:$N$50,8,FALSE),VLOOKUP(D119,DATA!$B$27:$N$50,9,FALSE),VLOOKUP(D119,DATA!$B$27:$N$50,10,FALSE),VLOOKUP(D119,DATA!$B$27:$N$50,11,FALSE),VLOOKUP(D119,DATA!$B$27:$N$50,12,FALSE),VLOOKUP(D119,DATA!$B$27:$N$50,13,FALSE),\"\")*(IF(F120=1,1,0))","v":0},{"$f":"CHOOSE(H119,VLOOKUP(D119,DATA!$B$52:$N$75,2,FALSE),VLOOKUP(D119,DATA!$B$52:$N$75,3,FALSE),VLOOKUP(D119,DATA!$B$52:$N$75,4,FALSE),VLOOKUP(D119,DATA!$B$52:$N$77,5,FALSE),VLOOKUP(D119,DATA!$B$52:$N$75,6,FALSE),VLOOKUP(D119,DATA!$B$52:$N$75,7,FALSE),VLOOKUP(D119,DATA!$B$52:$N$75,8,FALSE),VLOOKUP(D119,DATA!$B$52:$N$75,9,FALSE),VLOOKUP(D119,DATA!$B$52:$N$75,10,FALSE),VLOOKUP(D119,DATA!$B$52:$N$75,11,FALSE),VLOOKUP(D119,DATA!$B$52:$N$75,12,FALSE),VLOOKUP(D119,DATA!$B$52:$N$75,13,FALSE),\"\")*(IF(F121=1,1,0))","v":0},{"$f":"CHOOSE(H119,VLOOKUP(D119,DATA!$B$77:$N$100,2,FALSE),VLOOKUP(D119,DATA!$B$77:$N$100,3,FALSE),VLOOKUP(D119,DATA!$B$77:$N$100,4,FALSE),VLOOKUP(D119,DATA!$B$77:$N$100,5,FALSE),VLOOKUP(D119,DATA!$B$77:$N$100,6,FALSE),VLOOKUP(D119,DATA!$B$77:$N$100,7,FALSE),VLOOKUP(D119,DATA!$B$77:$N$100,8,FALSE),VLOOKUP(D119,DATA!$B$77:$N$100,9,FALSE),VLOOKUP(D119,DATA!$B$77:$N$100,10,FALSE),VLOOKUP(D119,DATA!$B$77:$N$100,11,FALSE),VLOOKUP(D119,DATA!$B$77:$N$100,12,FALSE),VLOOKUP(D119,DATA!$B$77:$N$100,13,FALSE),\"\")*(IF(F122=1,1,0))","v":0},{"$f":"CHOOSE(H119,VLOOKUP(D119,DATA!$B$102:$N$125,2,FALSE),VLOOKUP(D119,DATA!$B$102:$N$125,3,FALSE),VLOOKUP(D119,DATA!$B$102:$N$125,4,FALSE),VLOOKUP(D119,DATA!$B$102:$N$125,5,FALSE),VLOOKUP(D119,DATA!$B$102:$N$125,6,FALSE),VLOOKUP(D119,DATA!$B$102:$N$125,7,FALSE),VLOOKUP(D119,DATA!$B$102:$N$125,8,FALSE),VLOOKUP(D119,DATA!$B$102:$N$125,9,FALSE),VLOOKUP(D119,DATA!$B$102:$N$125,10,FALSE),VLOOKUP(D119,DATA!$B$102:$N$125,11,FALSE),VLOOKUP(D119,DATA!$B$102:$N$125,12,FALSE),VLOOKUP(D119,DATA!$B$102:$N$125,13,FALSE),\"\")*(IF(F122=1,1,0))","v":0},{"$f":"利用申込書2!AG50","v":""},{"$f":"IF(AND(F120=1,F121=1,F122=1),\"午前-午後-夜間\",(IF(AND(F120=1,F121=1,F122=2),\"午前-午後\",(IF(AND(F120=2,F121=1,F122=1),\"午後-夜間\",(IF(AND(F120=1,F121=2,F122=2),\"午前\",(IF(AND(F120=2,F121=1,F122=2),\"午後\",IF(AND(F120=1,F121=2,F122=1),\"午前・夜間\",\"夜間\"))))))))))","v":"夜間"},null,{"$f":"IF(I119>0,VLOOKUP(O119,$A$235:$B$238,2,FALSE),VLOOKUP(O119,$A$226:$B$232,2,FALSE))","v":"18:00-21:00"},{"$f":"IF(B119=B115,\"\",B119)","v":""},{"$f":"B119","v":"00:00:00"},{"$f":"YEAR(S119)","v":1900},"年",{"$f":"T119&U119&T120&U120","v":"1900年1月"},{"$f":"IF(AND(F120=1,F121=1,F122=1),\"APN\",(IF(AND(F120=1,F121=1,F122=2),\"AP\",(IF(AND(F120=2,F121=1,F122=1),\"PN\",(IF(AND(F120=1,F121=2,F122=2),\"A\",(IF(AND(F120=2,F121=1,F122=2),\"P\",\"N\")))))))))","v":"N"},{"$f":"利用申込書1!$AV$50","v":""},{"$f":"X120&W119&\"・\"&AB119","v":"0N・"},{"$f":"T119&U119","v":"1900年"},null,{"$f":"CLEAN(X119)","v":""}]
[null,{"$f":"TEXT(B119,\"YYYY\")","v":"1900"},null,null,"チェック2",{"$f":"IF(F119=1,1,IF(G120,1,2))","v":2},false,null,null,{"$f":"B122&$J$6","v":"0A"},{"$f":"B122&$K$6","v":"0P"},{"$f":"B122&$L$6","v":"0N"},null,null,null,null,null,null,{"$f":"B119","v":"00:00:00"},{"$f":"MONTH(S119)","v":1},"月",{"$f":"T120&U120&T121&U121","v":"1月0日"},{"$f":"D119","v":0},{"$f":"LEFT(W120,3)","v":"0"}]
[null,{"$f":"TEXT(B119,\"YYYYmm\")","v":"190001"},null,null,"チェック3",2,false,null,null,{"$f":"G120","v":false},{"$f":"G121","v":false},{"$f":"G122","v":false},null,null,null,null,null,null,null,{"$f":"DAY(S119)","v":0},"日",{"$f":"T121&U121","v":"0日"}]
[null,{"$f":"TEXT(B119,\"d\")","v":"0"},null,null,"チェック4",2,false,null,null,null,null,null,null,null,null,null,null,null,null,null,null,{"$f":"T120&U120","v":"1月"}]
[{"$f":"IF(D123=\"大会議室(準備)\",\"大会議室\",(IF(D123=\"大会議室(本番)\",\"大会議室\",(IF(D123=\"ピアザホール(準備)\",\"PH\",IF(D123=\"ピアザホール(本番)\",\"PH\",IF(D123=\"練習室(一般)\",\"練習室\",IF(D123=\"練習室(学生)\",\"練習室\",D123))))))))","v":0},{"$f":"IF(利用申込書2!A52=\"\", B119,利用申込書2!A52)","v":"00:00:00"},{"$f":"IF(OR((WEEKDAY(B123,2)>=6),COUNTIF(DATA!$Q$3:$T$23,B123)),2,1)","v":2},{"$f":"利用申込書2!F52","v":0},"チェック1",{"$f":"IF(G123,1,2)","v":2},false,{"$f":"IF(AND($C$1=1,$C$2=1,C123=1),1,(IF(AND($C$1=1,$C$2=2,C123=1),2,(IF(AND($C$1=1,$C$2=3,C123=1),3,(IF(AND($C$1=2,$C$2=1,C123=1),4,(IF(AND($C$1=2,$C$2=2,C123=1),5,(IF(AND($C$1=2,$C$2=3,C123=1),6,(IF(AND($C$1=1,$C$2=1,C123=2),7,(IF(AND($C$1=1,$C$2=2,C123=2),8,(IF(AND($C$1=1,$C$2=3,C123=2),9,(IF(AND($C$1=2,$C$2=1,C123=2),10,(IF(AND($C$1=2,$C$2=2,C123=2),11,(IF(AND($C$1=2,$C$2=3,C123=2),12,\"\")))))))))))))))))))))))","v":7},{"$f":"CHOOSE(H123,VLOOKUP(D123,DATA!$B$2:$N$25,2,FALSE),VLOOKUP(D123,DATA!$B$2:$N$25,3,FALSE),VLOOKUP(D123,DATA!$B$2:$N$25,4,FALSE),VLOOKUP(D123,DATA!$B$2:$N$25,5,FALSE),VLOOKUP(D123,DATA!$B$2:$N$25,6,FALSE),VLOOKUP(D123,DATA!$B$2:$N$25,7,FALSE),VLOOKUP(D123,DATA!$B$2:$N$25,8,FALSE),VLOOKUP(D123,DATA!$B$2:$N$25,9,FALSE),VLOOKUP(D123,DATA!$B$2:$N$25,10,FALSE),VLOOKUP(D123,DATA!$B$2:$N$25,11,FALSE),VLOOKUP(D123,DATA!$B$2:$N$25,12,FALSE),VLOOKUP(D123,DATA!$B$2:$N$25,13,FALSE),\"\")*(IF(F123=1,1,0))","v":0},{"$f":"CHOOSE(H123,VLOOKUP(D123,DATA!$B$27:$N$50,2,FALSE),VLOOKUP(D123,DATA!$B$27:$N$50,3,FALSE),VLOOKUP(D123,DATA!$B$27:$N$50,4,FALSE),VLOOKUP(D123,DATA!$B$27:$N$50,5,FALSE),VLOOKUP(D123,DATA!$B$27:$N$50,6,FALSE),VLOOKUP(D123,DATA!$B$27:$N$50,7,FALSE),VLOOKUP(D123,DATA!$B$27:$N$50,8,FALSE),VLOOKUP(D123,DATA!$B$27:$N$50,9,FALSE),VLOOKUP(D123,DATA!$B$27:$N$50,10,FALSE),VLOOKUP(D123,DATA!$B$27:$N$50,11,FALSE),VLOOKUP(D123,DATA!$B$27:$N$50,12,FALSE),VLOOKUP(D123,DATA!$B$27:$N$50,13,FALSE),\"\")*(IF(F124=1,1,0))","v":0},{"$f":"CHOOSE(H123,VLOOKUP(D123,DATA!$B$52:$N$75,2,FALSE),VLOOKUP(D123,DATA!$B$52:$N$75,3,FALSE),VLOOKUP(D123,DATA!$B$52:$N$75,4,FALSE),VLOOKUP(D123,DATA!$B$52:$N$77,5,FALSE),VLOOKUP(D123,DATA!$B$52:$N$75,6,FALSE),VLOOKUP(D123,DATA!$B$52:$N$75,7,FALSE),VLOOKUP(D123,DATA!$B$52:$N$75,8,FALSE),VLOOKUP(D123,DATA!$B$52:$N$75,9,FALSE),VLOOKUP(D123,DATA!$B$52:$N$75,10,FALSE),VLOOKUP(D123,DATA!$B$52:$N$75,11,FALSE),VLOOKUP(D123,DATA!$B$52:$N$75,12,FALSE),VLOOKUP(D123,DATA!$B$52:$N$75,13,FALSE),\"\")*(IF(F125=1,1,0))","v":0},{"$f":"CHOOSE(H123,VLOOKUP(D123,DATA!$B$77:$N$100,2,FALSE),VLOOKUP(D123,DATA!$B$77:$N$100,3,FALSE),VLOOKUP(D123,DATA!$B$77:$N$100,4,FALSE),VLOOKUP(D123,DATA!$B$77:$N$100,5,FALSE),VLOOKUP(D123,DATA!$B$77:$N$100,6,FALSE),VLOOKUP(D123,DATA!$B$77:$N$100,7,FALSE),VLOOKUP(D123,DATA!$B$77:$N$100,8,FALSE),VLOOKUP(D123,DATA!$B$77:$N$100,9,FALSE),VLOOKUP(D123,DATA!$B$77:$N$100,10,FALSE),VLOOKUP(D123,DATA!$B$77:$N$100,11,FALSE),VLOOKUP(D123,DATA!$B$77:$N$100,12,FALSE),VLOOKUP(D123,DATA!$B$77:$N$100,13,FALSE),\"\")*(IF(F126=1,1,0))","v":0},{"$f":"CHOOSE(H123,VLOOKUP(D123,DATA!$B$102:$N$125,2,FALSE),VLOOKUP(D123,DATA!$B$102:$N$125,3,FALSE),VLOOKUP(D123,DATA!$B$102:$N$125,4,FALSE),VLOOKUP(D123,DATA!$B$102:$N$125,5,FALSE),VLOOKUP(D123,DATA!$B$102:$N$125,6,FALSE),VLOOKUP(D123,DATA!$B$102:$N$125,7,FALSE),VLOOKUP(D123,DATA!$B$102:$N$125,8,FALSE),VLOOKUP(D123,DATA!$B$102:$N$125,9,FALSE),VLOOKUP(D123,DATA!$B$102:$N$125,10,FALSE),VLOOKUP(D123,DATA!$B$102:$N$125,11,FALSE),VLOOKUP(D123,DATA!$B$102:$N$125,12,FALSE),VLOOKUP(D123,DATA!$B$102:$N$125,13,FALSE),\"\")*(IF(F126=1,1,0))","v":0},{"$f":"利用申込書2!AG52","v":""},{"$f":"IF(AND(F124=1,F125=1,F126=1),\"午前-午後-夜間\",(IF(AND(F124=1,F125=1,F126=2),\"午前-午後\",(IF(AND(F124=2,F125=1,F126=1),\"午後-夜間\",(IF(AND(F124=1,F125=2,F126=2),\"午前\",(IF(AND(F124=2,F125=1,F126=2),\"午後\",IF(AND(F124=1,F125=2,F126=1),\"午前・夜間\",\"夜間\"))))))))))","v":"夜間"},null,{"$f":"IF(I123>0,VLOOKUP(O123,$A$235:$B$238,2,FALSE),VLOOKUP(O123,$A$226:$B$232,2,FALSE))","v":"18:00-21:00"},{"$f":"IF(B123=B119,\"\",B123)","v":""},{"$f":"B123","v":"00:00:00"},{"$f":"YEAR(S123)","v":1900},"年",{"$f":"T123&U123&T124&U124","v":"1900年1月"},{"$f":"IF(AND(F124=1,F125=1,F126=1),\"APN\",(IF(AND(F124=1,F125=1,F126=2),\"AP\",(IF(AND(F124=2,F125=1,F126=1),\"PN\",(IF(AND(F124=1,F125=2,F126=2),\"A\",(IF(AND(F124=2,F125=1,F126=2),\"P\",\"N\")))))))))","v":"N"},{"$f":"利用申込書1!$AV$50","v":""},{"$f":"X124&W123&\"・\"&AB123","v":"0N・"},{"$f":"T123&U123","v":"1900年"},null,{"$f":"CLEAN(X123)","v":""}]
[null,{"$f":"TEXT(B123,\"YYYY\")","v":"1900"},null,null,"チェック2",{"$f":"IF(F123=1,1,IF(G124,1,2))","v":2},false,null,null,{"$f":"B126&$J$6","v":"0A"},{"$f":"B126&$K$6","v":"0P"},{"$f":"B126&$L$6","v":"0N"},null,null,null,null,null,null,{"$f":"B123","v":"00:00:00"},{"$f":"MONTH(S123)","v":1},"月",{"$f":"T124&U124&T125&U125","v":"1月0日"},{"$f":"D123","v":0},{"$f":"LEFT(W124,3)","v":"0"}]
[null,{"$f":"TEXT(B123,\"YYYYmm\")","v":"190001"},null,null,"チェック3",2,false,null,null,{"$f":"G124","v":false},{"$f":"G125","v":false},{"$f":"G126","v":false},null,null,null,null,null,null,null,{"$f":"DAY(S123)","v":0},"日",{"$f":"T125&U125","v":"0日"}]
[null,{"$f":"TEXT(B123,\"d\")","v":"0"},null,null,"チェック4",2,false,null,null,null,null,null,null,null,null,null,null,null,null,null,null,{"$f":"T124&U124","v":"1月"}]
[{"$f":"IF(D127=\"大会議室(準備)\",\"大会議室\",(IF(D127=\"大会議室(本番)\",\"大会議室\",(IF(D127=\"ピアザホール(準備)\",\"PH\",IF(D127=\"ピアザホール(本番)\",\"PH\",IF(D127=\"練習室(一般)\",\"練習室\",IF(D127=\"練習室(学生)\",\"練習室\",D127))))))))","v":0},{"$f":"IF(利用申込書2!A54=\"\", B123,利用申込書2!A54)","v":"00:00:00"},{"$f":"IF(OR((WEEKDAY(B127,2)>=6),COUNTIF(DATA!$Q$3:$T$23,B127)),2,1)","v":2},{"$f":"利用申込書2!F54","v":0},"チェック1",2,false,{"$f":"IF(AND($C$1=1,$C$2=1,C127=1),1,(IF(AND($C$1=1,$C$2=2,C127=1),2,(IF(AND($C$1=1,$C$2=3,C127=1),3,(IF(AND($C$1=2,$C$2=1,C127=1),4,(IF(AND($C$1=2,$C$2=2,C127=1),5,(IF(AND($C$1=2,$C$2=3,C127=1),6,(IF(AND($C$1=1,$C$2=1,C127=2),7,(IF(AND($C$1=1,$C$2=2,C127=2),8,(IF(AND($C$1=1,$C$2=3,C127=2),9,(IF(AND($C$1=2,$C$2=1,C127=2),10,(IF(AND($C$1=2,$C$2=2,C127=2),11,(IF(AND($C$1=2,$C$2=3,C127=2),12,\"\")))))))))))))))))))))))","v":7},{"$f":"CHOOSE(H127,VLOOKUP(D127,DATA!$B$2:$N$25,2,FALSE),VLOOKUP(D127,DATA!$B$2:$N$25,3,FALSE),VLOOKUP(D127,DATA!$B$2:$N$25,4,FALSE),VLOOKUP(D127,DATA!$B$2:$N$25,5,FALSE),VLOOKUP(D127,DATA!$B$2:$N$25,6,FALSE),VLOOKUP(D127,DATA!$B$2:$N$25,7,FALSE),VLOOKUP(D127,DATA!$B$2:$N$25,8,FALSE),VLOOKUP(D127,DATA!$B$2:$N$25,9,FALSE),VLOOKUP(D127,DATA!$B$2:$N$25,10,FALSE),VLOOKUP(D127,DATA!$B$2:$N$25,11,FALSE),VLOOKUP(D127,DATA!$B$2:$N$25,12,FALSE),VLOOKUP(D127,DATA!$B$2:$N$25,13,FALSE),\"\")*(IF(F127=1,1,0))","v":0},{"$f":"CHOOSE(H127,VLOOKUP(D127,DATA!$B$27:$N$50,2,FALSE),VLOOKUP(D127,DATA!$B$27:$N$50,3,FALSE),VLOOKUP(D127,DATA!$B$27:$N$50,4,FALSE),VLOOKUP(D127,DATA!$B$27:$N$50,5,FALSE),VLOOKUP(D127,DATA!$B$27:$N$50,6,FALSE),VLOOKUP(D127,DATA!$B$27:$N$50,7,FALSE),VLOOKUP(D127,DATA!$B$27:$N$50,8,FALSE),VLOOKUP(D127,DATA!$B$27:$N$50,9,FALSE),VLOOKUP(D127,DATA!$B$27:$N$50,10,FALSE),VLOOKUP(D127,DATA!$B$27:$N$50,11,FALSE),VLOOKUP(D127,DATA!$B$27:$N$50,12,FALSE),VLOOKUP(D127,DATA!$B$27:$N$50,13,FALSE),\"\")*(IF(F128=1,1,0))","v":0},{"$f":"CHOOSE(H127,VLOOKUP(D127,DATA!$B$52:$N$75,2,FALSE),VLOOKUP(D127,DATA!$B$52:$N$75,3,FALSE),VLOOKUP(D127,DATA!$B$52:$N$75,4,FALSE),VLOOKUP(D127,DATA!$B$52:$N$77,5,FALSE),VLOOKUP(D127,DATA!$B$52:$N$75,6,FALSE),VLOOKUP(D127,DATA!$B$52:$N$75,7,FALSE),VLOOKUP(D127,DATA!$B$52:$N$75,8,FALSE),VLOOKUP(D127,DATA!$B$52:$N$75,9,FALSE),VLOOKUP(D127,DATA!$B$52:$N$75,10,FALSE),VLOOKUP(D127,DATA!$B$52:$N$75,11,FALSE),VLOOKUP(D127,DATA!$B$52:$N$75,12,FALSE),VLOOKUP(D127,DATA!$B$52:$N$75,13,FALSE),\"\")*(IF(F129=1,1,0))","v":0},{"$f":"CHOOSE(H127,VLOOKUP(D127,DATA!$B$77:$N$100,2,FALSE),VLOOKUP(D127,DATA!$B$77:$N$100,3,FALSE),VLOOKUP(D127,DATA!$B$77:$N$100,4,FALSE),VLOOKUP(D127,DATA!$B$77:$N$100,5,FALSE),VLOOKUP(D127,DATA!$B$77:$N$100,6,FALSE),VLOOKUP(D127,DATA!$B$77:$N$100,7,FALSE),VLOOKUP(D127,DATA!$B$77:$N$100,8,FALSE),VLOOKUP(D127,DATA!$B$77:$N$100,9,FALSE),VLOOKUP(D127,DATA!$B$77:$N$100,10,FALSE),VLOOKUP(D127,DATA!$B$77:$N$100,11,FALSE),VLOOKUP(D127,DATA!$B$77:$N$100,12,FALSE),VLOOKUP(D127,DATA!$B$77:$N$100,13,FALSE),\"\")*(IF(F130=1,1,0))","v":0},{"$f":"CHOOSE(H127,VLOOKUP(D127,DATA!$B$102:$N$125,2,FALSE),VLOOKUP(D127,DATA!$B$102:$N$125,3,FALSE),VLOOKUP(D127,DATA!$B$102:$N$125,4,FALSE),VLOOKUP(D127,DATA!$B$102:$N$125,5,FALSE),VLOOKUP(D127,DATA!$B$102:$N$125,6,FALSE),VLOOKUP(D127,DATA!$B$102:$N$125,7,FALSE),VLOOKUP(D127,DATA!$B$102:$N$125,8,FALSE),VLOOKUP(D127,DATA!$B$102:$N$125,9,FALSE),VLOOKUP(D127,DATA!$B$102:$N$125,10,FALSE),VLOOKUP(D127,DATA!$B$102:$N$125,11,FALSE),VLOOKUP(D127,DATA!$B$102:$N$125,12,FALSE),VLOOKUP(D127,DATA!$B$102:$N$125,13,FALSE),\"\")*(IF(F130=1,1,0))","v":0},{"$f":"利用申込書2!AG54","v":""},{"$f":"IF(AND(F128=1,F129=1,F130=1),\"午前-午後-夜間\",(IF(AND(F128=1,F129=1,F130=2),\"午前-午後\",(IF(AND(F128=2,F129=1,F130=1),\"午後-夜間\",(IF(AND(F128=1,F129=2,F130=2),\"午前\",(IF(AND(F128=2,F129=1,F130=2),\"午後\",IF(AND(F128=1,F129=2,F130=1),\"午前・夜間\",\"夜間\"))))))))))","v":"夜間"},null,{"$f":"IF(I127>0,VLOOKUP(O127,$A$235:$B$238,2,FALSE),VLOOKUP(O127,$A$226:$B$232,2,FALSE))","v":"18:00-21:00"},{"$f":"IF(B127=B123,\"\",B127)","v":""},{"$f":"B127","v":"00:00:00"},{"$f":"YEAR(S127)","v":1900},"年",{"$f":"T127&U127&T128&U128","v":"1900年1月"},{"$f":"IF(AND(F128=1,F129=1,F130=1),\"APN\",(IF(AND(F128=1,F129=1,F130=2),\"AP\",(IF(AND(F128=2,F129=1,F130=1),\"PN\",(IF(AND(F128=1,F129=2,F130=2),\"A\",(IF(AND(F128=2,F129=1,F130=2),\"P\",\"N\")))))))))","v":"N"},{"$f":"利用申込書1!$AV$50","v":""},{"$f":"X128&W127&\"・\"&AB127","v":"0N・"},{"$f":"T127&U127","v":"1900年"},null,{"$f":"CLEAN(X127)","v":""}]
[null,{"$f":"TEXT(B127,\"YYYY\")","v":"1900"},null,null,"チェック2",{"$f":"IF(F127=1,1,IF(G128,1,2))","v":2},false,null,null,{"$f":"B130&$J$6","v":"0A"},{"$f":"B130&$K$6","v":"0P"},{"$f":"B130&$L$6","v":"0N"},null,null,null,null,null,null,{"$f":"B127","v":"00:00:00"},{"$f":"MONTH(S127)","v":1},"月",{"$f":"T128&U128&T129&U129","v":"1月0日"},{"$f":"D127","v":0},{"$f":"LEFT(W128,3)","v":"0"}]
[null,{"$f":"TEXT(B127,\"YYYYmm\")","v":"190001"},null,null,"チェック3",2,false,null,null,{"$f":"G128","v":false},{"$f":"G129","v":false},{"$f":"G130","v":false},null,null,null,null,null,null,null,{"$f":"DAY(S127)","v":0},"日",{"$f":"T129&U129","v":"0日"}]
[null,{"$f":"TEXT(B127,\"d\")","v":"0"},null,null,"チェック4",2,false,null,null,null,null,null,null,null,null,null,null,null,null,null,null,{"$f":"T128&U128","v":"1月"}]
[{"$f":"IF(D131=\"大会議室(準備)\",\"大会議室\",(IF(D131=\"大会議室(本番)\",\"大会議室\",(IF(D131=\"ピアザホール(準備)\",\"PH\",IF(D131=\"ピアザホール(本番)\",\"PH\",IF(D131=\"練習室(一般)\",\"練習室\",IF(D131=\"練習室(学生)\",\"練習室\",D131))))))))","v":0},{"$f":"IF(利用申込書3!A10=\"\", B127,利用申込書3!A10)","v":"00:00:00"},{"$f":"IF(OR((WEEKDAY(B131,2)>=6),COUNTIF(DATA!$Q$3:$T$23,B131)),2,1)","v":2},{"$f":"利用申込書3!F10","v":0},"チェック1",{"$f":"IF(G131,1,2)","v":2},false,{"$f":"IF(AND($C$1=1,$C$2=1,C131=1),1,(IF(AND($C$1=1,$C$2=2,C131=1),2,(IF(AND($C$1=1,$C$2=3,C131=1),3,(IF(AND($C$1=2,$C$2=1,C131=1),4,(IF(AND($C$1=2,$C$2=2,C131=1),5,(IF(AND($C$1=2,$C$2=3,C131=1),6,(IF(AND($C$1=1,$C$2=1,C131=2),7,(IF(AND($C$1=1,$C$2=2,C131=2),8,(IF(AND($C$1=1,$C$2=3,C131=2),9,(IF(AND($C$1=2,$C$2=1,C131=2),10,(IF(AND($C$1=2,$C$2=2,C131=2),11,(IF(AND($C$1=2,$C$2=3,C131=2),12,\"\")))))))))))))))))))))))","v":7},{"$f":"CHOOSE(H131,VLOOKUP(D131,DATA!$B$2:$N$25,2,FALSE),VLOOKUP(D131,DATA!$B$2:$N$25,3,FALSE),VLOOKUP(D131,DATA!$B$2:$N$25,4,FALSE),VLOOKUP(D131,DATA!$B$2:$N$25,5,FALSE),VLOOKUP(D131,DATA!$B$2:$N$25,6,FALSE),VLOOKUP(D131,DATA!$B$2:$N$25,7,FALSE),VLOOKUP(D131,DATA!$B$2:$N$25,8,FALSE),VLOOKUP(D131,DATA!$B$2:$N$25,9,FALSE),VLOOKUP(D131,DATA!$B$2:$N$25,10,FALSE),VLOOKUP(D131,DATA!$B$2:$N$25,11,FALSE),VLOOKUP(D131,DATA!$B$2:$N$25,12,FALSE),VLOOKUP(D131,DATA!$B$2:$N$25,13,FALSE),\"\")*(IF(F131=1,1,0))","v":0},{"$f":"CHOOSE(H131,VLOOKUP(D131,DATA!$B$27:$N$50,2,FALSE),VLOOKUP(D131,DATA!$B$27:$N$50,3,FALSE),VLOOKUP(D131,DATA!$B$27:$N$50,4,FALSE),VLOOKUP(D131,DATA!$B$27:$N$50,5,FALSE),VLOOKUP(D131,DATA!$B$27:$N$50,6,FALSE),VLOOKUP(D131,DATA!$B$27:$N$50,7,FALSE),VLOOKUP(D131,DATA!$B$27:$N$50,8,FALSE),VLOOKUP(D131,DATA!$B$27:$N$50,9,FALSE),VLOOKUP(D131,DATA!$B$27:$N$50,10,FALSE),VLOOKUP(D131,DATA!$B$27:$N$50,11,FALSE),VLOOKUP(D131,DATA!$B$27:$N$50,12,FALSE),VLOOKUP(D131,DATA!$B$27:$N$50,13,FALSE),\"\")*(IF(F132=1,1,0))","v":0},{"$f":"CHOOSE(H131,VLOOKUP(D131,DATA!$B$52:$N$75,2,FALSE),VLOOKUP(D131,DATA!$B$52:$N$75,3,FALSE),VLOOKUP(D131,DATA!$B$52:$N$75,4,FALSE),VLOOKUP(D131,DATA!$B$52:$N$77,5,FALSE),VLOOKUP(D131,DATA!$B$52:$N$75,6,FALSE),VLOOKUP(D131,DATA!$B$52:$N$75,7,FALSE),VLOOKUP(D131,DATA!$B$52:$N$75,8,FALSE),VLOOKUP(D131,DATA!$B$52:$N$75,9,FALSE),VLOOKUP(D131,DATA!$B$52:$N$75,10,FALSE),VLOOKUP(D131,DATA!$B$52:$N$75,11,FALSE),VLOOKUP(D131,DATA!$B$52:$N$75,12,FALSE),VLOOKUP(D131,DATA!$B$52:$N$75,13,FALSE),\"\")*(IF(F133=1,1,0))","v":0},{"$f":"CHOOSE(H131,VLOOKUP(D131,DATA!$B$77:$N$100,2,FALSE),VLOOKUP(D131,DATA!$B$77:$N$100,3,FALSE),VLOOKUP(D131,DATA!$B$77:$N$100,4,FALSE),VLOOKUP(D131,DATA!$B$77:$N$100,5,FALSE),VLOOKUP(D131,DATA!$B$77:$N$100,6,FALSE),VLOOKUP(D131,DATA!$B$77:$N$100,7,FALSE),VLOOKUP(D131,DATA!$B$77:$N$100,8,FALSE),VLOOKUP(D131,DATA!$B$77:$N$100,9,FALSE),VLOOKUP(D131,DATA!$B$77:$N$100,10,FALSE),VLOOKUP(D131,DATA!$B$77:$N$100,11,FALSE),VLOOKUP(D131,DATA!$B$77:$N$100,12,FALSE),VLOOKUP(D131,DATA!$B$77:$N$100,13,FALSE),\"\")*(IF(F134=1,1,0))","v":0},{"$f":"CHOOSE(H131,VLOOKUP(D131,DATA!$B$102:$N$125,2,FALSE),VLOOKUP(D131,DATA!$B$102:$N$125,3,FALSE),VLOOKUP(D131,DATA!$B$102:$N$125,4,FALSE),VLOOKUP(D131,DATA!$B$102:$N$125,5,FALSE),VLOOKUP(D131,DATA!$B$102:$N$125,6,FALSE),VLOOKUP(D131,DATA!$B$102:$N$125,7,FALSE),VLOOKUP(D131,DATA!$B$102:$N$125,8,FALSE),VLOOKUP(D131,DATA!$B$102:$N$125,9,FALSE),VLOOKUP(D131,DATA!$B$102:$N$125,10,FALSE),VLOOKUP(D131,DATA!$B$102:$N$125,11,FALSE),VLOOKUP(D131,DATA!$B$102:$N$125,12,FALSE),VLOOKUP(D131,DATA!$B$102:$N$125,13,FALSE),\"\")*(IF(F134=1,1,0))","v":0},{"$f":"利用申込書2!AG10","v":""},{"$f":"IF(AND(F132=1,F133=1,F134=1),\"午前-午後-夜間\",(IF(AND(F132=1,F133=1,F134=2),\"午前-午後\",(IF(AND(F132=2,F133=1,F134=1),\"午後-夜間\",(IF(AND(F132=1,F133=2,F134=2),\"午前\",(IF(AND(F132=2,F133=1,F134=2),\"午後\",IF(AND(F132=1,F133=2,F134=1),\"午前・夜間\",\"夜間\"))))))))))","v":"夜間"},null,{"$f":"IF(I131>0,VLOOKUP(O131,$A$235:$B$238,2,FALSE),VLOOKUP(O131,$A$226:$B$232,2,FALSE))","v":"18:00-21:00"},{"$f":"IF(B131=B127,\"\",B131)","v":""},{"$f":"B131","v":"00:00:00"},{"$f":"YEAR(S131)","v":1900},"年",{"$f":"T131&U131&T132&U132","v":"1900年1月"},{"$f":"IF(AND(F132=1,F133=1,F134=1),\"APN\",(IF(AND(F132=1,F133=1,F134=2),\"AP\",(IF(AND(F132=2,F133=1,F134=1),\"PN\",(IF(AND(F132=1,F133=2,F134=2),\"A\",(IF(AND(F132=2,F133=1,F134=2),\"P\",\"N\")))))))))","v":"N"},{"$f":"利用申込書1!$AV$50","v":""},{"$f":"X132&W131&\"・\"&AB131","v":"0N・"},{"$f":"T131&U131","v":"1900年"},null,{"$f":"CLEAN(X131)","v":""}]
[null,{"$f":"TEXT(B131,\"YYYY\")","v":"1900"},null,null,"チェック2",{"$f":"IF(F131=1,1,IF(G132,1,2))","v":2},false,null,null,{"$f":"B134&$J$6","v":"0A"},{"$f":"B134&$K$6","v":"0P"},{"$f":"B134&$L$6","v":"0N"},null,null,null,null,null,null,{"$f":"B131","v":"00:00:00"},{"$f":"MONTH(S131)","v":1},"月",{"$f":"T132&U132&T133&U133","v":"1月0日"},{"$f":"D131","v":0},{"$f":"LEFT(W132,3)","v":"0"}]
[null,{"$f":"TEXT(B131,\"YYYYmm\")","v":"190001"},null,null,"チェック3",2,false,null,null,{"$f":"G132","v":false},{"$f":"G133","v":false},{"$f":"G134","v":false},null,null,null,null,null,null,null,{"$f":"DAY(S131)","v":0},"日",{"$f":"T133&U133","v":"0日"}]
[null,{"$f":"TEXT(B131,\"d\")","v":"0"},null,null,"チェック4",2,false,null,null,null,null,null,null,null,null,null,null,null,null,null,null,{"$f":"T132&U132","v":"1月"}]
[{"$f":"IF(D135=\"大会議室(準備)\",\"大会議室\",(IF(D135=\"大会議室(本番)\",\"大会議室\",(IF(D135=\"ピアザホール(準備)\",\"PH\",IF(D135=\"ピアザホール(本番)\",\"PH\",IF(D135=\"練習室(一般)\",\"練習室\",IF(D135=\"練習室(学生)\",\"練習室\",D135))))))))","v":0},{"$f":"IF(利用申込書3!A12=\"\", B131,利用申込書3!A12)","v":"00:00:00"},{"$f":"IF(OR((WEEKDAY(B135,2)>=6),COUNTIF(DATA!$Q$3:$T$23,B135)),2,1)","v":2},{"$f":"利用申込書3!F12","v":0},"チェック1",2,false,{"$f":"IF(AND($C$1=1,$C$2=1,C135=1),1,(IF(AND($C$1=1,$C$2=2,C135=1),2,(IF(AND($C$1=1,$C$2=3,C135=1),3,(IF(AND($C$1=2,$C$2=1,C135=1),4,(IF(AND($C$1=2,$C$2=2,C135=1),5,(IF(AND($C$1=2,$C$2=3,C135=1),6,(IF(AND($C$1=1,$C$2=1,C135=2),7,(IF(AND($C$1=1,$C$2=2,C135=2),8,(IF(AND($C$1=1,$C$2=3,C135=2),9,(IF(AND($C$1=2,$C$2=1,C135=2),10,(IF(AND($C$1=2,$C$2=2,C135=2),11,(IF(AND($C$1=2,$C$2=3,C135=2),12,\"\")))))))))))))))))))))))","v":7},{"$f":"CHOOSE(H135,VLOOKUP(D135,DATA!$B$2:$N$25,2,FALSE),VLOOKUP(D135,DATA!$B$2:$N$25,3,FALSE),VLOOKUP(D135,DATA!$B$2:$N$25,4,FALSE),VLOOKUP(D135,DATA!$B$2:$N$25,5,FALSE),VLOOKUP(D135,DATA!$B$2:$N$25,6,FALSE),VLOOKUP(D135,DATA!$B$2:$N$25,7,FALSE),VLOOKUP(D135,DATA!$B$2:$N$25,8,FALSE),VLOOKUP(D135,DATA!$B$2:$N$25,9,FALSE),VLOOKUP(D135,DATA!$B$2:$N$25,10,FALSE),VLOOKUP(D135,DATA!$B$2:$N$25,11,FALSE),VLOOKUP(D135,DATA!$B$2:$N$25,12,FALSE),VLOOKUP(D135,DATA!$B$2:$N$25,13,FALSE),\"\")*(IF(F135=1,1,0))","v":0},{"$f":"CHOOSE(H135,VLOOKUP(D135,DATA!$B$27:$N$50,2,FALSE),VLOOKUP(D135,DATA!$B$27:$N$50,3,FALSE),VLOOKUP(D135,DATA!$B$27:$N$50,4,FALSE),VLOOKUP(D135,DATA!$B$27:$N$50,5,FALSE),VLOOKUP(D135,DATA!$B$27:$N$50,6,FALSE),VLOOKUP(D135,DATA!$B$27:$N$50,7,FALSE),VLOOKUP(D135,DATA!$B$27:$N$50,8,FALSE),VLOOKUP(D135,DATA!$B$27:$N$50,9,FALSE),VLOOKUP(D135,DATA!$B$27:$N$50,10,FALSE),VLOOKUP(D135,DATA!$B$27:$N$50,11,FALSE),VLOOKUP(D135,DATA!$B$27:$N$50,12,FALSE),VLOOKUP(D135,DATA!$B$27:$N$50,13,FALSE),\"\")*(IF(F136=1,1,0))","v":0},{"$f":"CHOOSE(H135,VLOOKUP(D135,DATA!$B$52:$N$75,2,FALSE),VLOOKUP(D135,DATA!$B$52:$N$75,3,FALSE),VLOOKUP(D135,DATA!$B$52:$N$75,4,FALSE),VLOOKUP(D135,DATA!$B$52:$N$77,5,FALSE),VLOOKUP(D135,DATA!$B$52:$N$75,6,FALSE),VLOOKUP(D135,DATA!$B$52:$N$75,7,FALSE),VLOOKUP(D135,DATA!$B$52:$N$75,8,FALSE),VLOOKUP(D135,DATA!$B$52:$N$75,9,FALSE),VLOOKUP(D135,DATA!$B$52:$N$75,10,FALSE),VLOOKUP(D135,DATA!$B$52:$N$75,11,FALSE),VLOOKUP(D135,DATA!$B$52:$N$75,12,FALSE),VLOOKUP(D135,DATA!$B$52:$N$75,13,FALSE),\"\")*(IF(F137=1,1,0))","v":0},{"$f":"CHOOSE(H135,VLOOKUP(D135,DATA!$B$77:$N$100,2,FALSE),VLOOKUP(D135,DATA!$B$77:$N$100,3,FALSE),VLOOKUP(D135,DATA!$B$77:$N$100,4,FALSE),VLOOKUP(D135,DATA!$B$77:$N$100,5,FALSE),VLOOKUP(D135,DATA!$B$77:$N$100,6,FALSE),VLOOKUP(D135,DATA!$B$77:$N$100,7,FALSE),VLOOKUP(D135,DATA!$B$77:$N$100,8,FALSE),VLOOKUP(D135,DATA!$B$77:$N$100,9,FALSE),VLOOKUP(D135,DATA!$B$77:$N$100,10,FALSE),VLOOKUP(D135,DATA!$B$77:$N$100,11,FALSE),VLOOKUP(D135,DATA!$B$77:$N$100,12,FALSE),VLOOKUP(D135,DATA!$B$77:$N$100,13,FALSE),\"\")*(IF(F138=1,1,0))","v":0},{"$f":"CHOOSE(H135,VLOOKUP(D135,DATA!$B$102:$N$125,2,FALSE),VLOOKUP(D135,DATA!$B$102:$N$125,3,FALSE),VLOOKUP(D135,DATA!$B$102:$N$125,4,FALSE),VLOOKUP(D135,DATA!$B$102:$N$125,5,FALSE),VLOOKUP(D135,DATA!$B$102:$N$125,6,FALSE),VLOOKUP(D135,DATA!$B$102:$N$125,7,FALSE),VLOOKUP(D135,DATA!$B$102:$N$125,8,FALSE),VLOOKUP(D135,DATA!$B$102:$N$125,9,FALSE),VLOOKUP(D135,DATA!$B$102:$N$125,10,FALSE),VLOOKUP(D135,DATA!$B$102:$N$125,11,FALSE),VLOOKUP(D135,DATA!$B$102:$N$125,12,FALSE),VLOOKUP(D135,DATA!$B$102:$N$125,13,FALSE),\"\")*(IF(F138=1,1,0))","v":0},{"$f":"利用申込書2!AG12","v":""}]
[null,{"$f":"TEXT(B135,\"YYYY\")","v":"1900"},null,null,"チェック2",{"$f":"IF(F135=1,1,IF(G136,1,2))","v":2},false,null,null,{"$f":"B138&$J$6","v":"0A"},{"$f":"B138&$K$6","v":"0P"},{"$f":"B138&$L$6","v":"0N"}]
[null,{"$f":"TEXT(B135,\"YYYYmm\")","v":"190001"},null,null,"チェック3",2,false,null,null,{"$f":"G136","v":false},{"$f":"G137","v":false},{"$f":"G138","v":false}]
[null,{"$f":"TEXT(B135,\"d\")","v":"0"},null,null,"チェック4",2,false]
[{"$f":"IF(D139=\"大会議室(準備)\",\"大会議室\",(IF(D139=\"大会議室(本番)\",\"大会議室\",(IF(D139=\"ピアザホール(準備)\",\"PH\",IF(D139=\"ピアザホール(本番)\",\"PH\",IF(D139=\"練習室(一般)\",\"練習室\",IF(D139=\"練習室(学生)\",\"練習室\",D139))))))))","v":0},{"$f":"IF(利用申込書3!A14=\"\", B135,利用申込書3!A14)","v":"00:00:00"},{"$f":"IF(OR((WEEKDAY(B139,2)>=6),COUNTIF(DATA!$Q$3:$T$23,B139)),2,1)","v":2},{"$f":"利用申込書3!F14","v":0},"チェック1",2,false,{"$f":"IF(AND($C$1=1,$C$2=1,C139=1),1,(IF(AND($C$1=1,$C$2=2,C139=1),2,(IF(AND($C$1=1,$C$2=3,C139=1),3,(IF(AND($C$1=2,$C$2=1,C139=1),4,(IF(AND($C$1=2,$C$2=2,C139=1),5,(IF(AND($C$1=2,$C$2=3,C139=1),6,(IF(AND($C$1=1,$C$2=1,C139=2),7,(IF(AND($C$1=1,$C$2=2,C139=2),8,(IF(AND($C$1=1,$C$2=3,C139=2),9,(IF(AND($C$1=2,$C$2=1,C139=2),10,(IF(AND($C$1=2,$C$2=2,C139=2),11,(IF(AND($C$1=2,$C$2=3,C139=2),12,\"\")))))))))))))))))))))))","v":7},{"$f":"CHOOSE(H139,VLOOKUP(D139,DATA!$B$2:$N$25,2,FALSE),VLOOKUP(D139,DATA!$B$2:$N$25,3,FALSE),VLOOKUP(D139,DATA!$B$2:$N$25,4,FALSE),VLOOKUP(D139,DATA!$B$2:$N$25,5,FALSE),VLOOKUP(D139,DATA!$B$2:$N$25,6,FALSE),VLOOKUP(D139,DATA!$B$2:$N$25,7,FALSE),VLOOKUP(D139,DATA!$B$2:$N$25,8,FALSE),VLOOKUP(D139,DATA!$B$2:$N$25,9,FALSE),VLOOKUP(D139,DATA!$B$2:$N$25,10,FALSE),VLOOKUP(D139,DATA!$B$2:$N$25,11,FALSE),VLOOKUP(D139,DATA!$B$2:$N$25,12,FALSE),VLOOKUP(D139,DATA!$B$2:$N$25,13,FALSE),\"\")*(IF(F139=1,1,0))","v":0},{"$f":"CHOOSE(H139,VLOOKUP(D139,DATA!$B$27:$N$50,2,FALSE),VLOOKUP(D139,DATA!$B$27:$N$50,3,FALSE),VLOOKUP(D139,DATA!$B$27:$N$50,4,FALSE),VLOOKUP(D139,DATA!$B$27:$N$50,5,FALSE),VLOOKUP(D139,DATA!$B$27:$N$50,6,FALSE),VLOOKUP(D139,DATA!$B$27:$N$50,7,FALSE),VLOOKUP(D139,DATA!$B$27:$N$50,8,FALSE),VLOOKUP(D139,DATA!$B$27:$N$50,9,FALSE),VLOOKUP(D139,DATA!$B$27:$N$50,10,FALSE),VLOOKUP(D139,DATA!$B$27:$N$50,11,FALSE),VLOOKUP(D139,DATA!$B$27:$N$50,12,FALSE),VLOOKUP(D139,DATA!$B$27:$N$50,13,FALSE),\"\")*(IF(F140=1,1,0))","v":0},{"$f":"CHOOSE(H139,VLOOKUP(D139,DATA!$B$52:$N$75,2,FALSE),VLOOKUP(D139,DATA!$B$52:$N$75,3,FALSE),VLOOKUP(D139,DATA!$B$52:$N$75,4,FALSE),VLOOKUP(D139,DATA!$B$52:$N$77,5,FALSE),VLOOKUP(D139,DATA!$B$52:$N$75,6,FALSE),VLOOKUP(D139,DATA!$B$52:$N$75,7,FALSE),VLOOKUP(D139,DATA!$B$52:$N$75,8,FALSE),VLOOKUP(D139,DATA!$B$52:$N$75,9,FALSE),VLOOKUP(D139,DATA!$B$52:$N$75,10,FALSE),VLOOKUP(D139,DATA!$B$52:$N$75,11,FALSE),VLOOKUP(D139,DATA!$B$52:$N$75,12,FALSE),VLOOKUP(D139,DATA!$B$52:$N$75,13,FALSE),\"\")*(IF(F141=1,1,0))","v":0},{"$f":"CHOOSE(H139,VLOOKUP(D139,DATA!$B$77:$N$100,2,FALSE),VLOOKUP(D139,DATA!$B$77:$N$100,3,FALSE),VLOOKUP(D139,DATA!$B$77:$N$100,4,FALSE),VLOOKUP(D139,DATA!$B$77:$N$100,5,FALSE),VLOOKUP(D139,DATA!$B$77:$N$100,6,FALSE),VLOOKUP(D139,DATA!$B$77:$N$100,7,FALSE),VLOOKUP(D139,DATA!$B$77:$N$100,8,FALSE),VLOOKUP(D139,DATA!$B$77:$N$100,9,FALSE),VLOOKUP(D139,DATA!$B$77:$N$100,10,FALSE),VLOOKUP(D139,DATA!$B$77:$N$100,11,FALSE),VLOOKUP(D139,DATA!$B$77:$N$100,12,FALSE),VLOOKUP(D139,DATA!$B$77:$N$100,13,FALSE),\"\")*(IF(F142=1,1,0))","v":0},{"$f":"CHOOSE(H139,VLOOKUP(D139,DATA!$B$102:$N$125,2,FALSE),VLOOKUP(D139,DATA!$B$102:$N$125,3,FALSE),VLOOKUP(D139,DATA!$B$102:$N$125,4,FALSE),VLOOKUP(D139,DATA!$B$102:$N$125,5,FALSE),VLOOKUP(D139,DATA!$B$102:$N$125,6,FALSE),VLOOKUP(D139,DATA!$B$102:$N$125,7,FALSE),VLOOKUP(D139,DATA!$B$102:$N$125,8,FALSE),VLOOKUP(D139,DATA!$B$102:$N$125,9,FALSE),VLOOKUP(D139,DATA!$B$102:$N$125,10,FALSE),VLOOKUP(D139,DATA!$B$102:$N$125,11,FALSE),VLOOKUP(D139,DATA!$B$102:$N$125,12,FALSE),VLOOKUP(D139,DATA!$B$102:$N$125,13,FALSE),\"\")*(IF(F142=1,1,0))","v":0},{"$f":"利用申込書2!AG14","v":""}]
[null,{"$f":"TEXT(B139,\"YYYY\")","v":"1900"},null,null,"チェック2",{"$f":"IF(F139=1,1,IF(G140,1,2))","v":2},false,null,null,{"$f":"B142&$J$6","v":"0A"},{"$f":"B142&$K$6","v":"0P"},{"$f":"B142&$L$6","v":"0N"}]
[null,{"$f":"TEXT(B139,\"YYYYmm\")","v":"190001"},null,null,"チェック3",2,false,null,null,{"$f":"G140","v":false},{"$f":"G141","v":false},{"$f":"G142","v":false}]
[null,{"$f":"TEXT(B139,\"d\")","v":"0"},null,null,"チェック4",2,false]
[{"$f":"IF(D143=\"大会議室(準備)\",\"大会議室\",(IF(D143=\"大会議室(本番)\",\"大会議室\",(IF(D143=\"ピアザホール(準備)\",\"PH\",IF(D143=\"ピアザホール(本番)\",\"PH\",IF(D143=\"練習室(一般)\",\"練習室\",IF(D143=\"練習室(学生)\",\"練習室\",D143))))))))","v":0},{"$f":"IF(利用申込書3!A16=\"\", B139,利用申込書3!A16)","v":"00:00:00"},{"$f":"IF(OR((WEEKDAY(B143,2)>=6),COUNTIF(DATA!$Q$3:$T$23,B143)),2,1)","v":2},{"$f":"利用申込書3!F16","v":0},"チェック1",2,false,{"$f":"IF(AND($C$1=1,$C$2=1,C143=1),1,(IF(AND($C$1=1,$C$2=2,C143=1),2,(IF(AND($C$1=1,$C$2=3,C143=1),3,(IF(AND($C$1=2,$C$2=1,C143=1),4,(IF(AND($C$1=2,$C$2=2,C143=1),5,(IF(AND($C$1=2,$C$2=3,C143=1),6,(IF(AND($C$1=1,$C$2=1,C143=2),7,(IF(AND($C$1=1,$C$2=2,C143=2),8,(IF(AND($C$1=1,$C$2=3,C143=2),9,(IF(AND($C$1=2,$C$2=1,C143=2),10,(IF(AND($C$1=2,$C$2=2,C143=2),11,(IF(AND($C$1=2,$C$2=3,C143=2),12,\"\")))))))))))))))))))))))","v":7},{"$f":"CHOOSE(H143,VLOOKUP(D143,DATA!$B$2:$N$25,2,FALSE),VLOOKUP(D143,DATA!$B$2:$N$25,3,FALSE),VLOOKUP(D143,DATA!$B$2:$N$25,4,FALSE),VLOOKUP(D143,DATA!$B$2:$N$25,5,FALSE),VLOOKUP(D143,DATA!$B$2:$N$25,6,FALSE),VLOOKUP(D143,DATA!$B$2:$N$25,7,FALSE),VLOOKUP(D143,DATA!$B$2:$N$25,8,FALSE),VLOOKUP(D143,DATA!$B$2:$N$25,9,FALSE),VLOOKUP(D143,DATA!$B$2:$N$25,10,FALSE),VLOOKUP(D143,DATA!$B$2:$N$25,11,FALSE),VLOOKUP(D143,DATA!$B$2:$N$25,12,FALSE),VLOOKUP(D143,DATA!$B$2:$N$25,13,FALSE),\"\")*(IF(F143=1,1,0))","v":0},{"$f":"CHOOSE(H143,VLOOKUP(D143,DATA!$B$27:$N$50,2,FALSE),VLOOKUP(D143,DATA!$B$27:$N$50,3,FALSE),VLOOKUP(D143,DATA!$B$27:$N$50,4,FALSE),VLOOKUP(D143,DATA!$B$27:$N$50,5,FALSE),VLOOKUP(D143,DATA!$B$27:$N$50,6,FALSE),VLOOKUP(D143,DATA!$B$27:$N$50,7,FALSE),VLOOKUP(D143,DATA!$B$27:$N$50,8,FALSE),VLOOKUP(D143,DATA!$B$27:$N$50,9,FALSE),VLOOKUP(D143,DATA!$B$27:$N$50,10,FALSE),VLOOKUP(D143,DATA!$B$27:$N$50,11,FALSE),VLOOKUP(D143,DATA!$B$27:$N$50,12,FALSE),VLOOKUP(D143,DATA!$B$27:$N$50,13,FALSE),\"\")*(IF(F144=1,1,0))","v":0},{"$f":"CHOOSE(H143,VLOOKUP(D143,DATA!$B$52:$N$75,2,FALSE),VLOOKUP(D143,DATA!$B$52:$N$75,3,FALSE),VLOOKUP(D143,DATA!$B$52:$N$75,4,FALSE),VLOOKUP(D143,DATA!$B$52:$N$77,5,FALSE),VLOOKUP(D143,DATA!$B$52:$N$75,6,FALSE),VLOOKUP(D143,DATA!$B$52:$N$75,7,FALSE),VLOOKUP(D143,DATA!$B$52:$N$75,8,FALSE),VLOOKUP(D143,DATA!$B$52:$N$75,9,FALSE),VLOOKUP(D143,DATA!$B$52:$N$75,10,FALSE),VLOOKUP(D143,DATA!$B$52:$N$75,11,FALSE),VLOOKUP(D143,DATA!$B$52:$N$75,12,FALSE),VLOOKUP(D143,DATA!$B$52:$N$75,13,FALSE),\"\")*(IF(F145=1,1,0))","v":0},{"$f":"CHOOSE(H143,VLOOKUP(D143,DATA!$B$77:$N$100,2,FALSE),VLOOKUP(D143,DATA!$B$77:$N$100,3,FALSE),VLOOKUP(D143,DATA!$B$77:$N$100,4,FALSE),VLOOKUP(D143,DATA!$B$77:$N$100,5,FALSE),VLOOKUP(D143,DATA!$B$77:$N$100,6,FALSE),VLOOKUP(D143,DATA!$B$77:$N$100,7,FALSE),VLOOKUP(D143,DATA!$B$77:$N$100,8,FALSE),VLOOKUP(D143,DATA!$B$77:$N$100,9,FALSE),VLOOKUP(D143,DATA!$B$77:$N$100,10,FALSE),VLOOKUP(D143,DATA!$B$77:$N$100,11,FALSE),VLOOKUP(D143,DATA!$B$77:$N$100,12,FALSE),VLOOKUP(D143,DATA!$B$77:$N$100,13,FALSE),\"\")*(IF(F146=1,1,0))","v":0},{"$f":"CHOOSE(H143,VLOOKUP(D143,DATA!$B$102:$N$125,2,FALSE),VLOOKUP(D143,DATA!$B$102:$N$125,3,FALSE),VLOOKUP(D143,DATA!$B$102:$N$125,4,FALSE),VLOOKUP(D143,DATA!$B$102:$N$125,5,FALSE),VLOOKUP(D143,DATA!$B$102:$N$125,6,FALSE),VLOOKUP(D143,DATA!$B$102:$N$125,7,FALSE),VLOOKUP(D143,DATA!$B$102:$N$125,8,FALSE),VLOOKUP(D143,DATA!$B$102:$N$125,9,FALSE),VLOOKUP(D143,DATA!$B$102:$N$125,10,FALSE),VLOOKUP(D143,DATA!$B$102:$N$125,11,FALSE),VLOOKUP(D143,DATA!$B$102:$N$125,12,FALSE),VLOOKUP(D143,DATA!$B$102:$N$125,13,FALSE),\"\")*(IF(F146=1,1,0))","v":0},{"$f":"利用申込書2!AG16","v":""}]
[null,{"$f":"TEXT(B143,\"YYYY\")","v":"1900"},null,null,"チェック2",{"$f":"IF(F143=1,1,IF(G144,1,2))","v":2},false,null,null,{"$f":"B146&$J$6","v":"0A"},{"$f":"B146&$K$6","v":"0P"},{"$f":"B146&$L$6","v":"0N"}]
[null,{"$f":"TEXT(B143,\"YYYYmm\")","v":"190001"},null,null,"チェック3",2,false,null,null,{"$f":"G144","v":false},{"$f":"G145","v":false},{"$f":"G146","v":false}]
[null,{"$f":"TEXT(B143,\"d\")","v":"0"},null,null,"チェック4",2,false]
[{"$f":"IF(D147=\"大会議室(準備)\",\"大会議室\",(IF(D147=\"大会議室(本番)\",\"大会議室\",(IF(D147=\"ピアザホール(準備)\",\"PH\",IF(D147=\"ピアザホール(本番)\",\"PH\",IF(D147=\"練習室(一般)\",\"練習室\",IF(D147=\"練習室(学生)\",\"練習室\",D147))))))))","v":0},{"$f":"IF(利用申込書3!A18=\"\", B143,利用申込書3!A18)","v":"00:00:00"},{"$f":"IF(OR((WEEKDAY(B147,2)>=6),COUNTIF(DATA!$Q$3:$T$23,B147)),2,1)","v":2},{"$f":"利用申込書3!F18","v":0},"チェック1",2,false,{"$f":"IF(AND($C$1=1,$C$2=1,C147=1),1,(IF(AND($C$1=1,$C$2=2,C147=1),2,(IF(AND($C$1=1,$C$2=3,C147=1),3,(IF(AND($C$1=2,$C$2=1,C147=1),4,(IF(AND($C$1=2,$C$2=2,C147=1),5,(IF(AND($C$1=2,$C$2=3,C147=1),6,(IF(AND($C$1=1,$C$2=1,C147=2),7,(IF(AND($C$1=1,$C$2=2,C147=2),8,(IF(AND($C$1=1,$C$2=3,C147=2),9,(IF(AND($C$1=2,$C$2=1,C147=2),10,(IF(AND($C$1=2,$C$2=2,C147=2),11,(IF(AND($C$1=2,$C$2=3,C147=2),12,\"\")))))))))))))))))))))))","v":7},{"$f":"CHOOSE(H147,VLOOKUP(D147,DATA!$B$2:$N$25,2,FALSE),VLOOKUP(D147,DATA!$B$2:$N$25,3,FALSE),VLOOKUP(D147,DATA!$B$2:$N$25,4,FALSE),VLOOKUP(D147,DATA!$B$2:$N$25,5,FALSE),VLOOKUP(D147,DATA!$B$2:$N$25,6,FALSE),VLOOKUP(D147,DATA!$B$2:$N$25,7,FALSE),VLOOKUP(D147,DATA!$B$2:$N$25,8,FALSE),VLOOKUP(D147,DATA!$B$2:$N$25,9,FALSE),VLOOKUP(D147,DATA!$B$2:$N$25,10,FALSE),VLOOKUP(D147,DATA!$B$2:$N$25,11,FALSE),VLOOKUP(D147,DATA!$B$2:$N$25,12,FALSE),VLOOKUP(D147,DATA!$B$2:$N$25,13,FALSE),\"\")*(IF(F147=1,1,0))","v":0},{"$f":"CHOOSE(H147,VLOOKUP(D147,DATA!$B$27:$N$50,2,FALSE),VLOOKUP(D147,DATA!$B$27:$N$50,3,FALSE),VLOOKUP(D147,DATA!$B$27:$N$50,4,FALSE),VLOOKUP(D147,DATA!$B$27:$N$50,5,FALSE),VLOOKUP(D147,DATA!$B$27:$N$50,6,FALSE),VLOOKUP(D147,DATA!$B$27:$N$50,7,FALSE),VLOOKUP(D147,DATA!$B$27:$N$50,8,FALSE),VLOOKUP(D147,DATA!$B$27:$N$50,9,FALSE),VLOOKUP(D147,DATA!$B$27:$N$50,10,FALSE),VLOOKUP(D147,DATA!$B$27:$N$50,11,FALSE),VLOOKUP(D147,DATA!$B$27:$N$50,12,FALSE),VLOOKUP(D147,DATA!$B$27:$N$50,13,FALSE),\"\")*(IF(F148=1,1,0))","v":0},{"$f":"CHOOSE(H147,VLOOKUP(D147,DATA!$B$52:$N$75,2,FALSE),VLOOKUP(D147,DATA!$B$52:$N$75,3,FALSE),VLOOKUP(D147,DATA!$B$52:$N$75,4,FALSE),VLOOKUP(D147,DATA!$B$52:$N$77,5,FALSE),VLOOKUP(D147,DATA!$B$52:$N$75,6,FALSE),VLOOKUP(D147,DATA!$B$52:$N$75,7,FALSE),VLOOKUP(D147,DATA!$B$52:$N$75,8,FALSE),VLOOKUP(D147,DATA!$B$52:$N$75,9,FALSE),VLOOKUP(D147,DATA!$B$52:$N$75,10,FALSE),VLOOKUP(D147,DATA!$B$52:$N$75,11,FALSE),VLOOKUP(D147,DATA!$B$52:$N$75,12,FALSE),VLOOKUP(D147,DATA!$B$52:$N$75,13,FALSE),\"\")*(IF(F149=1,1,0))","v":0},{"$f":"CHOOSE(H147,VLOOKUP(D147,DATA!$B$77:$N$100,2,FALSE),VLOOKUP(D147,DATA!$B$77:$N$100,3,FALSE),VLOOKUP(D147,DATA!$B$77:$N$100,4,FALSE),VLOOKUP(D147,DATA!$B$77:$N$100,5,FALSE),VLOOKUP(D147,DATA!$B$77:$N$100,6,FALSE),VLOOKUP(D147,DATA!$B$77:$N$100,7,FALSE),VLOOKUP(D147,DATA!$B$77:$N$100,8,FALSE),VLOOKUP(D147,DATA!$B$77:$N$100,9,FALSE),VLOOKUP(D147,DATA!$B$77:$N$100,10,FALSE),VLOOKUP(D147,DATA!$B$77:$N$100,11,FALSE),VLOOKUP(D147,DATA!$B$77:$N$100,12,FALSE),VLOOKUP(D147,DATA!$B$77:$N$100,13,FALSE),\"\")*(IF(F150=1,1,0))","v":0},{"$f":"CHOOSE(H147,VLOOKUP(D147,DATA!$B$102:$N$125,2,FALSE),VLOOKUP(D147,DATA!$B$102:$N$125,3,FALSE),VLOOKUP(D147,DATA!$B$102:$N$125,4,FALSE),VLOOKUP(D147,DATA!$B$102:$N$125,5,FALSE),VLOOKUP(D147,DATA!$B$102:$N$125,6,FALSE),VLOOKUP(D147,DATA!$B$102:$N$125,7,FALSE),VLOOKUP(D147,DATA!$B$102:$N$125,8,FALSE),VLOOKUP(D147,DATA!$B$102:$N$125,9,FALSE),VLOOKUP(D147,DATA!$B$102:$N$125,10,FALSE),VLOOKUP(D147,DATA!$B$102:$N$125,11,FALSE),VLOOKUP(D147,DATA!$B$102:$N$125,12,FALSE),VLOOKUP(D147,DATA!$B$102:$N$125,13,FALSE),\"\")*(IF(F150=1,1,0))","v":0},{"$f":"利用申込書2!AG18","v":""}]
[null,{"$f":"TEXT(B147,\"YYYY\")","v":"1900"},null,null,"チェック2",{"$f":"IF(F147=1,1,IF(G148,1,2))","v":2},false,null,null,{"$f":"B150&$J$6","v":"0A"},{"$f":"B150&$K$6","v":"0P"},{"$f":"B150&$L$6","v":"0N"}]
[null,{"$f":"TEXT(B147,\"YYYYmm\")","v":"190001"},null,null,"チェック3",2,false,null,null,{"$f":"G148","v":false},{"$f":"G149","v":false},{"$f":"G150","v":false}]
[null,{"$f":"TEXT(B147,\"d\")","v":"0"},null,null,"チェック4",2,false]
[{"$f":"IF(D151=\"大会議室(準備)\",\"大会議室\",(IF(D151=\"大会議室(本番)\",\"大会議室\",(IF(D151=\"ピアザホール(準備)\",\"PH\",IF(D151=\"ピアザホール(本番)\",\"PH\",IF(D151=\"練習室(一般)\",\"練習室\",IF(D151=\"練習室(学生)\",\"練習室\",D151))))))))","v":0},{"$f":"IF(利用申込書3!A20=\"\", B147,利用申込書3!A20)","v":"00:00:00"},{"$f":"IF(OR((WEEKDAY(B151,2)>=6),COUNTIF(DATA!$Q$3:$T$23,B151)),2,1)","v":2},{"$f":"利用申込書3!F20","v":0},"チェック1",2,false,{"$f":"IF(AND($C$1=1,$C$2=1,C151=1),1,(IF(AND($C$1=1,$C$2=2,C151=1),2,(IF(AND($C$1=1,$C$2=3,C151=1),3,(IF(AND($C$1=2,$C$2=1,C151=1),4,(IF(AND($C$1=2,$C$2=2,C151=1),5,(IF(AND($C$1=2,$C$2=3,C151=1),6,(IF(AND($C$1=1,$C$2=1,C151=2),7,(IF(AND($C$1=1,$C$2=2,C151=2),8,(IF(AND($C$1=1,$C$2=3,C151=2),9,(IF(AND($C$1=2,$C$2=1,C151=2),10,(IF(AND($C$1=2,$C$2=2,C151=2),11,(IF(AND($C$1=2,$C$2=3,C151=2),12,\"\")))))))))))))))))))))))","v":7},{"$f":"CHOOSE(H151,VLOOKUP(D151,DATA!$B$2:$N$25,2,FALSE),VLOOKUP(D151,DATA!$B$2:$N$25,3,FALSE),VLOOKUP(D151,DATA!$B$2:$N$25,4,FALSE),VLOOKUP(D151,DATA!$B$2:$N$25,5,FALSE),VLOOKUP(D151,DATA!$B$2:$N$25,6,FALSE),VLOOKUP(D151,DATA!$B$2:$N$25,7,FALSE),VLOOKUP(D151,DATA!$B$2:$N$25,8,FALSE),VLOOKUP(D151,DATA!$B$2:$N$25,9,FALSE),VLOOKUP(D151,DATA!$B$2:$N$25,10,FALSE),VLOOKUP(D151,DATA!$B$2:$N$25,11,FALSE),VLOOKUP(D151,DATA!$B$2:$N$25,12,FALSE),VLOOKUP(D151,DATA!$B$2:$N$25,13,FALSE),\"\")*(IF(F151=1,1,0))","v":0},{"$f":"CHOOSE(H151,VLOOKUP(D151,DATA!$B$27:$N$50,2,FALSE),VLOOKUP(D151,DATA!$B$27:$N$50,3,FALSE),VLOOKUP(D151,DATA!$B$27:$N$50,4,FALSE),VLOOKUP(D151,DATA!$B$27:$N$50,5,FALSE),VLOOKUP(D151,DATA!$B$27:$N$50,6,FALSE),VLOOKUP(D151,DATA!$B$27:$N$50,7,FALSE),VLOOKUP(D151,DATA!$B$27:$N$50,8,FALSE),VLOOKUP(D151,DATA!$B$27:$N$50,9,FALSE),VLOOKUP(D151,DATA!$B$27:$N$50,10,FALSE),VLOOKUP(D151,DATA!$B$27:$N$50,11,FALSE),VLOOKUP(D151,DATA!$B$27:$N$50,12,FALSE),VLOOKUP(D151,DATA!$B$27:$N$50,13,FALSE),\"\")*(IF(F152=1,1,0))","v":0},{"$f":"CHOOSE(H151,VLOOKUP(D151,DATA!$B$52:$N$75,2,FALSE),VLOOKUP(D151,DATA!$B$52:$N$75,3,FALSE),VLOOKUP(D151,DATA!$B$52:$N$75,4,FALSE),VLOOKUP(D151,DATA!$B$52:$N$77,5,FALSE),VLOOKUP(D151,DATA!$B$52:$N$75,6,FALSE),VLOOKUP(D151,DATA!$B$52:$N$75,7,FALSE),VLOOKUP(D151,DATA!$B$52:$N$75,8,FALSE),VLOOKUP(D151,DATA!$B$52:$N$75,9,FALSE),VLOOKUP(D151,DATA!$B$52:$N$75,10,FALSE),VLOOKUP(D151,DATA!$B$52:$N$75,11,FALSE),VLOOKUP(D151,DATA!$B$52:$N$75,12,FALSE),VLOOKUP(D151,DATA!$B$52:$N$75,13,FALSE),\"\")*(IF(F153=1,1,0))","v":0},{"$f":"CHOOSE(H151,VLOOKUP(D151,DATA!$B$77:$N$100,2,FALSE),VLOOKUP(D151,DATA!$B$77:$N$100,3,FALSE),VLOOKUP(D151,DATA!$B$77:$N$100,4,FALSE),VLOOKUP(D151,DATA!$B$77:$N$100,5,FALSE),VLOOKUP(D151,DATA!$B$77:$N$100,6,FALSE),VLOOKUP(D151,DATA!$B$77:$N$100,7,FALSE),VLOOKUP(D151,DATA!$B$77:$N$100,8,FALSE),VLOOKUP(D151,DATA!$B$77:$N$100,9,FALSE),VLOOKUP(D151,DATA!$B$77:$N$100,10,FALSE),VLOOKUP(D151,DATA!$B$77:$N$100,11,FALSE),VLOOKUP(D151,DATA!$B$77:$N$100,12,FALSE),VLOOKUP(D151,DATA!$B$77:$N$100,13,FALSE),\"\")*(IF(F154=1,1,0))","v":0},{"$f":"CHOOSE(H151,VLOOKUP(D151,DATA!$B$102:$N$125,2,FALSE),VLOOKUP(D151,DATA!$B$102:$N$125,3,FALSE),VLOOKUP(D151,DATA!$B$102:$N$125,4,FALSE),VLOOKUP(D151,DATA!$B$102:$N$125,5,FALSE),VLOOKUP(D151,DATA!$B$102:$N$125,6,FALSE),VLOOKUP(D151,DATA!$B$102:$N$125,7,FALSE),VLOOKUP(D151,DATA!$B$102:$N$125,8,FALSE),VLOOKUP(D151,DATA!$B$102:$N$125,9,FALSE),VLOOKUP(D151,DATA!$B$102:$N$125,10,FALSE),VLOOKUP(D151,DATA!$B$102:$N$125,11,FALSE),VLOOKUP(D151,DATA!$B$102:$N$125,12,FALSE),VLOOKUP(D151,DATA!$B$102:$N$125,13,FALSE),\"\")*(IF(F154=1,1,0))","v":0},{"$f":"利用申込書2!AG20","v":""}]
[null,{"$f":"TEXT(B151,\"YYYY\")","v":"1900"},null,null,"チェック2",{"$f":"IF(F151=1,1,IF(G152,1,2))","v":2},false,null,null,{"$f":"B154&$J$6","v":"0A"},{"$f":"B154&$K$6","v":"0P"},{"$f":"B154&$L$6","v":"0N"}]
[null,{"$f":"TEXT(B151,\"YYYYmm\")","v":"190001"},null,null,"チェック3",2,false,null,null,{"$f":"G152","v":false},{"$f":"G153","v":false},{"$f":"G154","v":false}]
[null,{"$f":"TEXT(B151,\"d\")","v":"0"},null,null,"チェック4",2,false]
[{"$f":"IF(D155=\"大会議室(準備)\",\"大会議室\",(IF(D155=\"大会議室(本番)\",\"大会議室\",(IF(D155=\"ピアザホール(準備)\",\"PH\",IF(D155=\"ピアザホール(本番)\",\"PH\",IF(D155=\"練習室(一般)\",\"練習室\",IF(D155=\"練習室(学生)\",\"練習室\",D155))))))))","v":0},{"$f":"IF(利用申込書3!A22=\"\", B151,利用申込書3!A22)","v":"00:00:00"},{"$f":"IF(OR((WEEKDAY(B155,2)>=6),COUNTIF(DATA!$Q$3:$T$23,B155)),2,1)","v":2},{"$f":"利用申込書3!F22","v":0},"チェック1",2,false,{"$f":"IF(AND($C$1=1,$C$2=1,C155=1),1,(IF(AND($C$1=1,$C$2=2,C155=1),2,(IF(AND($C$1=1,$C$2=3,C155=1),3,(IF(AND($C$1=2,$C$2=1,C155=1),4,(IF(AND($C$1=2,$C$2=2,C155=1),5,(IF(AND($C$1=2,$C$2=3,C155=1),6,(IF(AND($C$1=1,$C$2=1,C155=2),7,(IF(AND($C$1=1,$C$2=2,C155=2),8,(IF(AND($C$1=1,$C$2=3,C155=2),9,(IF(AND($C$1=2,$C$2=1,C155=2),10,(IF(AND($C$1=2,$C$2=2,C155=2),11,(IF(AND($C$1=2,$C$2=3,C155=2),12,\"\")))))))))))))))))))))))","v":7},{"$f":"CHOOSE(H155,VLOOKUP(D155,DATA!$B$2:$N$25,2,FALSE),VLOOKUP(D155,DATA!$B$2:$N$25,3,FALSE),VLOOKUP(D155,DATA!$B$2:$N$25,4,FALSE),VLOOKUP(D155,DATA!$B$2:$N$25,5,FALSE),VLOOKUP(D155,DATA!$B$2:$N$25,6,FALSE),VLOOKUP(D155,DATA!$B$2:$N$25,7,FALSE),VLOOKUP(D155,DATA!$B$2:$N$25,8,FALSE),VLOOKUP(D155,DATA!$B$2:$N$25,9,FALSE),VLOOKUP(D155,DATA!$B$2:$N$25,10,FALSE),VLOOKUP(D155,DATA!$B$2:$N$25,11,FALSE),VLOOKUP(D155,DATA!$B$2:$N$25,12,FALSE),VLOOKUP(D155,DATA!$B$2:$N$25,13,FALSE),\"\")*(IF(F155=1,1,0))","v":0},{"$f":"CHOOSE(H155,VLOOKUP(D155,DATA!$B$27:$N$50,2,FALSE),VLOOKUP(D155,DATA!$B$27:$N$50,3,FALSE),VLOOKUP(D155,DATA!$B$27:$N$50,4,FALSE),VLOOKUP(D155,DATA!$B$27:$N$50,5,FALSE),VLOOKUP(D155,DATA!$B$27:$N$50,6,FALSE),VLOOKUP(D155,DATA!$B$27:$N$50,7,FALSE),VLOOKUP(D155,DATA!$B$27:$N$50,8,FALSE),VLOOKUP(D155,DATA!$B$27:$N$50,9,FALSE),VLOOKUP(D155,DATA!$B$27:$N$50,10,FALSE),VLOOKUP(D155,DATA!$B$27:$N$50,11,FALSE),VLOOKUP(D155,DATA!$B$27:$N$50,12,FALSE),VLOOKUP(D155,DATA!$B$27:$N$50,13,FALSE),\"\")*(IF(F156=1,1,0))","v":0},{"$f":"CHOOSE(H155,VLOOKUP(D155,DATA!$B$52:$N$75,2,FALSE),VLOOKUP(D155,DATA!$B$52:$N$75,3,FALSE),VLOOKUP(D155,DATA!$B$52:$N$75,4,FALSE),VLOOKUP(D155,DATA!$B$52:$N$77,5,FALSE),VLOOKUP(D155,DATA!$B$52:$N$75,6,FALSE),VLOOKUP(D155,DATA!$B$52:$N$75,7,FALSE),VLOOKUP(D155,DATA!$B$52:$N$75,8,FALSE),VLOOKUP(D155,DATA!$B$52:$N$75,9,FALSE),VLOOKUP(D155,DATA!$B$52:$N$75,10,FALSE),VLOOKUP(D155,DATA!$B$52:$N$75,11,FALSE),VLOOKUP(D155,DATA!$B$52:$N$75,12,FALSE),VLOOKUP(D155,DATA!$B$52:$N$75,13,FALSE),\"\")*(IF(F157=1,1,0))","v":0},{"$f":"CHOOSE(H155,VLOOKUP(D155,DATA!$B$77:$N$100,2,FALSE),VLOOKUP(D155,DATA!$B$77:$N$100,3,FALSE),VLOOKUP(D155,DATA!$B$77:$N$100,4,FALSE),VLOOKUP(D155,DATA!$B$77:$N$100,5,FALSE),VLOOKUP(D155,DATA!$B$77:$N$100,6,FALSE),VLOOKUP(D155,DATA!$B$77:$N$100,7,FALSE),VLOOKUP(D155,DATA!$B$77:$N$100,8,FALSE),VLOOKUP(D155,DATA!$B$77:$N$100,9,FALSE),VLOOKUP(D155,DATA!$B$77:$N$100,10,FALSE),VLOOKUP(D155,DATA!$B$77:$N$100,11,FALSE),VLOOKUP(D155,DATA!$B$77:$N$100,12,FALSE),VLOOKUP(D155,DATA!$B$77:$N$100,13,FALSE),\"\")*(IF(F158=1,1,0))","v":0},{"$f":"CHOOSE(H155,VLOOKUP(D155,DATA!$B$102:$N$125,2,FALSE),VLOOKUP(D155,DATA!$B$102:$N$125,3,FALSE),VLOOKUP(D155,DATA!$B$102:$N$125,4,FALSE),VLOOKUP(D155,DATA!$B$102:$N$125,5,FALSE),VLOOKUP(D155,DATA!$B$102:$N$125,6,FALSE),VLOOKUP(D155,DATA!$B$102:$N$125,7,FALSE),VLOOKUP(D155,DATA!$B$102:$N$125,8,FALSE),VLOOKUP(D155,DATA!$B$102:$N$125,9,FALSE),VLOOKUP(D155,DATA!$B$102:$N$125,10,FALSE),VLOOKUP(D155,DATA!$B$102:$N$125,11,FALSE),VLOOKUP(D155,DATA!$B$102:$N$125,12,FALSE),VLOOKUP(D155,DATA!$B$102:$N$125,13,FALSE),\"\")*(IF(F158=1,1,0))","v":0},{"$f":"利用申込書2!AG22","v":""}]
[null,{"$f":"TEXT(B155,\"YYYY\")","v":"1900"},null,null,"チェック2",{"$f":"IF(F155=1,1,IF(G156,1,2))","v":2},false,null,null,{"$f":"B158&$J$6","v":"0A"},{"$f":"B158&$K$6","v":"0P"},{"$f":"B158&$L$6","v":"0N"}]
[null,{"$f":"TEXT(B155,\"YYYYmm\")","v":"190001"},null,null,"チェック3",2,false,null,null,{"$f":"G156","v":false},{"$f":"G157","v":false},{"$f":"G158","v":false}]
[null,{"$f":"TEXT(B155,\"d\")","v":"0"},null,null,"チェック4",2,false]
[{"$f":"IF(D159=\"大会議室(準備)\",\"大会議室\",(IF(D159=\"大会議室(本番)\",\"大会議室\",(IF(D159=\"ピアザホール(準備)\",\"PH\",IF(D159=\"ピアザホール(本番)\",\"PH\",IF(D159=\"練習室(一般)\",\"練習室\",IF(D159=\"練習室(学生)\",\"練習室\",D159))))))))","v":0},{"$f":"IF(利用申込書3!A24=\"\", B155,利用申込書3!A24)","v":"00:00:00"},{"$f":"IF(OR((WEEKDAY(B159,2)>=6),COUNTIF(DATA!$Q$3:$T$23,B159)),2,1)","v":2},{"$f":"利用申込書3!F24","v":0},"チェック1",2,false,{"$f":"IF(AND($C$1=1,$C$2=1,C159=1),1,(IF(AND($C$1=1,$C$2=2,C159=1),2,(IF(AND($C$1=1,$C$2=3,C159=1),3,(IF(AND($C$1=2,$C$2=1,C159=1),4,(IF(AND($C$1=2,$C$2=2,C159=1),5,(IF(AND($C$1=2,$C$2=3,C159=1),6,(IF(AND($C$1=1,$C$2=1,C159=2),7,(IF(AND($C$1=1,$C$2=2,C159=2),8,(IF(AND($C$1=1,$C$2=3,C159=2),9,(IF(AND($C$1=2,$C$2=1,C159=2),10,(IF(AND($C$1=2,$C$2=2,C159=2),11,(IF(AND($C$1=2,$C$2=3,C159=2),12,\"\")))))))))))))))))))))))","v":7},{"$f":"CHOOSE(H159,VLOOKUP(D159,DATA!$B$2:$N$25,2,FALSE),VLOOKUP(D159,DATA!$B$2:$N$25,3,FALSE),VLOOKUP(D159,DATA!$B$2:$N$25,4,FALSE),VLOOKUP(D159,DATA!$B$2:$N$25,5,FALSE),VLOOKUP(D159,DATA!$B$2:$N$25,6,FALSE),VLOOKUP(D159,DATA!$B$2:$N$25,7,FALSE),VLOOKUP(D159,DATA!$B$2:$N$25,8,FALSE),VLOOKUP(D159,DATA!$B$2:$N$25,9,FALSE),VLOOKUP(D159,DATA!$B$2:$N$25,10,FALSE),VLOOKUP(D159,DATA!$B$2:$N$25,11,FALSE),VLOOKUP(D159,DATA!$B$2:$N$25,12,FALSE),VLOOKUP(D159,DATA!$B$2:$N$25,13,FALSE),\"\")*(IF(F159=1,1,0))","v":0},{"$f":"CHOOSE(H159,VLOOKUP(D159,DATA!$B$27:$N$50,2,FALSE),VLOOKUP(D159,DATA!$B$27:$N$50,3,FALSE),VLOOKUP(D159,DATA!$B$27:$N$50,4,FALSE),VLOOKUP(D159,DATA!$B$27:$N$50,5,FALSE),VLOOKUP(D159,DATA!$B$27:$N$50,6,FALSE),VLOOKUP(D159,DATA!$B$27:$N$50,7,FALSE),VLOOKUP(D159,DATA!$B$27:$N$50,8,FALSE),VLOOKUP(D159,DATA!$B$27:$N$50,9,FALSE),VLOOKUP(D159,DATA!$B$27:$N$50,10,FALSE),VLOOKUP(D159,DATA!$B$27:$N$50,11,FALSE),VLOOKUP(D159,DATA!$B$27:$N$50,12,FALSE),VLOOKUP(D159,DATA!$B$27:$N$50,13,FALSE),\"\")*(IF(F160=1,1,0))","v":0},{"$f":"CHOOSE(H159,VLOOKUP(D159,DATA!$B$52:$N$75,2,FALSE),VLOOKUP(D159,DATA!$B$52:$N$75,3,FALSE),VLOOKUP(D159,DATA!$B$52:$N$75,4,FALSE),VLOOKUP(D159,DATA!$B$52:$N$77,5,FALSE),VLOOKUP(D159,DATA!$B$52:$N$75,6,FALSE),VLOOKUP(D159,DATA!$B$52:$N$75,7,FALSE),VLOOKUP(D159,DATA!$B$52:$N$75,8,FALSE),VLOOKUP(D159,DATA!$B$52:$N$75,9,FALSE),VLOOKUP(D159,DATA!$B$52:$N$75,10,FALSE),VLOOKUP(D159,DATA!$B$52:$N$75,11,FALSE),VLOOKUP(D159,DATA!$B$52:$N$75,12,FALSE),VLOOKUP(D159,DATA!$B$52:$N$75,13,FALSE),\"\")*(IF(F161=1,1,0))","v":0},{"$f":"CHOOSE(H159,VLOOKUP(D159,DATA!$B$77:$N$100,2,FALSE),VLOOKUP(D159,DATA!$B$77:$N$100,3,FALSE),VLOOKUP(D159,DATA!$B$77:$N$100,4,FALSE),VLOOKUP(D159,DATA!$B$77:$N$100,5,FALSE),VLOOKUP(D159,DATA!$B$77:$N$100,6,FALSE),VLOOKUP(D159,DATA!$B$77:$N$100,7,FALSE),VLOOKUP(D159,DATA!$B$77:$N$100,8,FALSE),VLOOKUP(D159,DATA!$B$77:$N$100,9,FALSE),VLOOKUP(D159,DATA!$B$77:$N$100,10,FALSE),VLOOKUP(D159,DATA!$B$77:$N$100,11,FALSE),VLOOKUP(D159,DATA!$B$77:$N$100,12,FALSE),VLOOKUP(D159,DATA!$B$77:$N$100,13,FALSE),\"\")*(IF(F162=1,1,0))","v":0},{"$f":"CHOOSE(H159,VLOOKUP(D159,DATA!$B$102:$N$125,2,FALSE),VLOOKUP(D159,DATA!$B$102:$N$125,3,FALSE),VLOOKUP(D159,DATA!$B$102:$N$125,4,FALSE),VLOOKUP(D159,DATA!$B$102:$N$125,5,FALSE),VLOOKUP(D159,DATA!$B$102:$N$125,6,FALSE),VLOOKUP(D159,DATA!$B$102:$N$125,7,FALSE),VLOOKUP(D159,DATA!$B$102:$N$125,8,FALSE),VLOOKUP(D159,DATA!$B$102:$N$125,9,FALSE),VLOOKUP(D159,DATA!$B$102:$N$125,10,FALSE),VLOOKUP(D159,DATA!$B$102:$N$125,11,FALSE),VLOOKUP(D159,DATA!$B$102:$N$125,12,FALSE),VLOOKUP(D159,DATA!$B$102:$N$125,13,FALSE),\"\")*(IF(F162=1,1,0))","v":0},{"$f":"利用申込書2!AG24","v":""}]
[null,{"$f":"TEXT(B159,\"YYYY\")","v":"1900"},null,null,"チェック2",{"$f":"IF(F159=1,1,IF(G160,1,2))","v":2},false,null,null,{"$f":"B162&$J$6","v":"0A"},{"$f":"B162&$K$6","v":"0P"},{"$f":"B162&$L$6","v":"0N"}]
[null,{"$f":"TEXT(B159,\"YYYYmm\")","v":"190001"},null,null,"チェック3",2,false,null,null,{"$f":"G160","v":false},{"$f":"G161","v":false},{"$f":"G162","v":false}]
[null,{"$f":"TEXT(B159,\"d\")","v":"0"},null,null,"チェック4",2,false]
[{"$f":"IF(D163=\"大会議室(準備)\",\"大会議室\",(IF(D163=\"大会議室(本番)\",\"大会議室\",(IF(D163=\"ピアザホール(準備)\",\"PH\",IF(D163=\"ピアザホール(本番)\",\"PH\",IF(D163=\"練習室(一般)\",\"練習室\",IF(D163=\"練習室(学生)\",\"練習室\",D163))))))))","v":0},{"$f":"IF(利用申込書3!A26=\"\", B159,利用申込書3!A26)","v":"00:00:00"},{"$f":"IF(OR((WEEKDAY(B163,2)>=6),COUNTIF(DATA!$Q$3:$T$23,B163)),2,1)","v":2},{"$f":"利用申込書3!F26","v":0},"チェック1",2,false,{"$f":"IF(AND($C$1=1,$C$2=1,C163=1),1,(IF(AND($C$1=1,$C$2=2,C163=1),2,(IF(AND($C$1=1,$C$2=3,C163=1),3,(IF(AND($C$1=2,$C$2=1,C163=1),4,(IF(AND($C$1=2,$C$2=2,C163=1),5,(IF(AND($C$1=2,$C$2=3,C163=1),6,(IF(AND($C$1=1,$C$2=1,C163=2),7,(IF(AND($C$1=1,$C$2=2,C163=2),8,(IF(AND($C$1=1,$C$2=3,C163=2),9,(IF(AND($C$1=2,$C$2=1,C163=2),10,(IF(AND($C$1=2,$C$2=2,C163=2),11,(IF(AND($C$1=2,$C$2=3,C163=2),12,\"\")))))))))))))))))))))))","v":7},{"$f":"CHOOSE(H163,VLOOKUP(D163,DATA!$B$2:$N$25,2,FALSE),VLOOKUP(D163,DATA!$B$2:$N$25,3,FALSE),VLOOKUP(D163,DATA!$B$2:$N$25,4,FALSE),VLOOKUP(D163,DATA!$B$2:$N$25,5,FALSE),VLOOKUP(D163,DATA!$B$2:$N$25,6,FALSE),VLOOKUP(D163,DATA!$B$2:$N$25,7,FALSE),VLOOKUP(D163,DATA!$B$2:$N$25,8,FALSE),VLOOKUP(D163,DATA!$B$2:$N$25,9,FALSE),VLOOKUP(D163,DATA!$B$2:$N$25,10,FALSE),VLOOKUP(D163,DATA!$B$2:$N$25,11,FALSE),VLOOKUP(D163,DATA!$B$2:$N$25,12,FALSE),VLOOKUP(D163,DATA!$B$2:$N$25,13,FALSE),\"\")*(IF(F163=1,1,0))","v":0},{"$f":"CHOOSE(H163,VLOOKUP(D163,DATA!$B$27:$N$50,2,FALSE),VLOOKUP(D163,DATA!$B$27:$N$50,3,FALSE),VLOOKUP(D163,DATA!$B$27:$N$50,4,FALSE),VLOOKUP(D163,DATA!$B$27:$N$50,5,FALSE),VLOOKUP(D163,DATA!$B$27:$N$50,6,FALSE),VLOOKUP(D163,DATA!$B$27:$N$50,7,FALSE),VLOOKUP(D163,DATA!$B$27:$N$50,8,FALSE),VLOOKUP(D163,DATA!$B$27:$N$50,9,FALSE),VLOOKUP(D163,DATA!$B$27:$N$50,10,FALSE),VLOOKUP(D163,DATA!$B$27:$N$50,11,FALSE),VLOOKUP(D163,DATA!$B$27:$N$50,12,FALSE),VLOOKUP(D163,DATA!$B$27:$N$50,13,FALSE),\"\")*(IF(F164=1,1,0))","v":0},{"$f":"CHOOSE(H163,VLOOKUP(D163,DATA!$B$52:$N$75,2,FALSE),VLOOKUP(D163,DATA!$B$52:$N$75,3,FALSE),VLOOKUP(D163,DATA!$B$52:$N$75,4,FALSE),VLOOKUP(D163,DATA!$B$52:$N$77,5,FALSE),VLOOKUP(D163,DATA!$B$52:$N$75,6,FALSE),VLOOKUP(D163,DATA!$B$52:$N$75,7,FALSE),VLOOKUP(D163,DATA!$B$52:$N$75,8,FALSE),VLOOKUP(D163,DATA!$B$52:$N$75,9,FALSE),VLOOKUP(D163,DATA!$B$52:$N$75,10,FALSE),VLOOKUP(D163,DATA!$B$52:$N$75,11,FALSE),VLOOKUP(D163,DATA!$B$52:$N$75,12,FALSE),VLOOKUP(D163,DATA!$B$52:$N$75,13,FALSE),\"\")*(IF(F165=1,1,0))","v":0},{"$f":"CHOOSE(H163,VLOOKUP(D163,DATA!$B$77:$N$100,2,FALSE),VLOOKUP(D163,DATA!$B$77:$N$100,3,FALSE),VLOOKUP(D163,DATA!$B$77:$N$100,4,FALSE),VLOOKUP(D163,DATA!$B$77:$N$100,5,FALSE),VLOOKUP(D163,DATA!$B$77:$N$100,6,FALSE),VLOOKUP(D163,DATA!$B$77:$N$100,7,FALSE),VLOOKUP(D163,DATA!$B$77:$N$100,8,FALSE),VLOOKUP(D163,DATA!$B$77:$N$100,9,FALSE),VLOOKUP(D163,DATA!$B$77:$N$100,10,FALSE),VLOOKUP(D163,DATA!$B$77:$N$100,11,FALSE),VLOOKUP(D163,DATA!$B$77:$N$100,12,FALSE),VLOOKUP(D163,DATA!$B$77:$N$100,13,FALSE),\"\")*(IF(F166=1,1,0))","v":0},{"$f":"CHOOSE(H163,VLOOKUP(D163,DATA!$B$102:$N$125,2,FALSE),VLOOKUP(D163,DATA!$B$102:$N$125,3,FALSE),VLOOKUP(D163,DATA!$B$102:$N$125,4,FALSE),VLOOKUP(D163,DATA!$B$102:$N$125,5,FALSE),VLOOKUP(D163,DATA!$B$102:$N$125,6,FALSE),VLOOKUP(D163,DATA!$B$102:$N$125,7,FALSE),VLOOKUP(D163,DATA!$B$102:$N$125,8,FALSE),VLOOKUP(D163,DATA!$B$102:$N$125,9,FALSE),VLOOKUP(D163,DATA!$B$102:$N$125,10,FALSE),VLOOKUP(D163,DATA!$B$102:$N$125,11,FALSE),VLOOKUP(D163,DATA!$B$102:$N$125,12,FALSE),VLOOKUP(D163,DATA!$B$102:$N$125,13,FALSE),\"\")*(IF(F166=1,1,0))","v":0},{"$f":"利用申込書2!AG26","v":""}]
[null,{"$f":"TEXT(B163,\"YYYY\")","v":"1900"},null,null,"チェック2",{"$f":"IF(F163=1,1,IF(G164,1,2))","v":2},false,null,null,{"$f":"B166&$J$6","v":"0A"},{"$f":"B166&$K$6","v":"0P"},{"$f":"B166&$L$6","v":"0N"}]
[null,{"$f":"TEXT(B163,\"YYYYmm\")","v":"190001"},null,null,"チェック3",2,false,null,null,{"$f":"G164","v":false},{"$f":"G165","v":false},{"$f":"G166","v":false}]
[null,{"$f":"TEXT(B163,\"d\")","v":"0"},null,null,"チェック4",2,false]
[{"$f":"IF(D167=\"大会議室(準備)\",\"大会議室\",(IF(D167=\"大会議室(本番)\",\"大会議室\",(IF(D167=\"ピアザホール(準備)\",\"PH\",IF(D167=\"ピアザホール(本番)\",\"PH\",IF(D167=\"練習室(一般)\",\"練習室\",IF(D167=\"練習室(学生)\",\"練習室\",D167))))))))","v":0},{"$f":"IF(利用申込書3!A28=\"\", B163,利用申込書3!A28)","v":"00:00:00"},{"$f":"IF(OR((WEEKDAY(B167,2)>=6),COUNTIF(DATA!$Q$3:$T$23,B167)),2,1)","v":2},{"$f":"利用申込書3!F28","v":0},"チェック1",2,false,{"$f":"IF(AND($C$1=1,$C$2=1,C167=1),1,(IF(AND($C$1=1,$C$2=2,C167=1),2,(IF(AND($C$1=1,$C$2=3,C167=1),3,(IF(AND($C$1=2,$C$2=1,C167=1),4,(IF(AND($C$1=2,$C$2=2,C167=1),5,(IF(AND($C$1=2,$C$2=3,C167=1),6,(IF(AND($C$1=1,$C$2=1,C167=2),7,(IF(AND($C$1=1,$C$2=2,C167=2),8,(IF(AND($C$1=1,$C$2=3,C167=2),9,(IF(AND($C$1=2,$C$2=1,C167=2),10,(IF(AND($C$1=2,$C$2=2,C167=2),11,(IF(AND($C$1=2,$C$2=3,C167=2),12,\"\")))))))))))))))))))))))","v":7},{"$f":"CHOOSE(H167,VLOOKUP(D167,DATA!$B$2:$N$25,2,FALSE),VLOOKUP(D167,DATA!$B$2:$N$25,3,FALSE),VLOOKUP(D167,DATA!$B$2:$N$25,4,FALSE),VLOOKUP(D167,DATA!$B$2:$N$25,5,FALSE),VLOOKUP(D167,DATA!$B$2:$N$25,6,FALSE),VLOOKUP(D167,DATA!$B$2:$N$25,7,FALSE),VLOOKUP(D167,DATA!$B$2:$N$25,8,FALSE),VLOOKUP(D167,DATA!$B$2:$N$25,9,FALSE),VLOOKUP(D167,DATA!$B$2:$N$25,10,FALSE),VLOOKUP(D167,DATA!$B$2:$N$25,11,FALSE),VLOOKUP(D167,DATA!$B$2:$N$25,12,FALSE),VLOOKUP(D167,DATA!$B$2:$N$25,13,FALSE),\"\")*(IF(F167=1,1,0))","v":0},{"$f":"CHOOSE(H167,VLOOKUP(D167,DATA!$B$27:$N$50,2,FALSE),VLOOKUP(D167,DATA!$B$27:$N$50,3,FALSE),VLOOKUP(D167,DATA!$B$27:$N$50,4,FALSE),VLOOKUP(D167,DATA!$B$27:$N$50,5,FALSE),VLOOKUP(D167,DATA!$B$27:$N$50,6,FALSE),VLOOKUP(D167,DATA!$B$27:$N$50,7,FALSE),VLOOKUP(D167,DATA!$B$27:$N$50,8,FALSE),VLOOKUP(D167,DATA!$B$27:$N$50,9,FALSE),VLOOKUP(D167,DATA!$B$27:$N$50,10,FALSE),VLOOKUP(D167,DATA!$B$27:$N$50,11,FALSE),VLOOKUP(D167,DATA!$B$27:$N$50,12,FALSE),VLOOKUP(D167,DATA!$B$27:$N$50,13,FALSE),\"\")*(IF(F168=1,1,0))","v":0},{"$f":"CHOOSE(H167,VLOOKUP(D167,DATA!$B$52:$N$75,2,FALSE),VLOOKUP(D167,DATA!$B$52:$N$75,3,FALSE),VLOOKUP(D167,DATA!$B$52:$N$75,4,FALSE),VLOOKUP(D167,DATA!$B$52:$N$77,5,FALSE),VLOOKUP(D167,DATA!$B$52:$N$75,6,FALSE),VLOOKUP(D167,DATA!$B$52:$N$75,7,FALSE),VLOOKUP(D167,DATA!$B$52:$N$75,8,FALSE),VLOOKUP(D167,DATA!$B$52:$N$75,9,FALSE),VLOOKUP(D167,DATA!$B$52:$N$75,10,FALSE),VLOOKUP(D167,DATA!$B$52:$N$75,11,FALSE),VLOOKUP(D167,DATA!$B$52:$N$75,12,FALSE),VLOOKUP(D167,DATA!$B$52:$N$75,13,FALSE),\"\")*(IF(F169=1,1,0))","v":0},{"$f":"CHOOSE(H167,VLOOKUP(D167,DATA!$B$77:$N$100,2,FALSE),VLOOKUP(D167,DATA!$B$77:$N$100,3,FALSE),VLOOKUP(D167,DATA!$B$77:$N$100,4,FALSE),VLOOKUP(D167,DATA!$B$77:$N$100,5,FALSE),VLOOKUP(D167,DATA!$B$77:$N$100,6,FALSE),VLOOKUP(D167,DATA!$B$77:$N$100,7,FALSE),VLOOKUP(D167,DATA!$B$77:$N$100,8,FALSE),VLOOKUP(D167,DATA!$B$77:$N$100,9,FALSE),VLOOKUP(D167,DATA!$B$77:$N$100,10,FALSE),VLOOKUP(D167,DATA!$B$77:$N$100,11,FALSE),VLOOKUP(D167,DATA!$B$77:$N$100,12,FALSE),VLOOKUP(D167,DATA!$B$77:$N$100,13,FALSE),\"\")*(IF(F170=1,1,0))","v":0},{"$f":"CHOOSE(H167,VLOOKUP(D167,DATA!$B$102:$N$125,2,FALSE),VLOOKUP(D167,DATA!$B$102:$N$125,3,FALSE),VLOOKUP(D167,DATA!$B$102:$N$125,4,FALSE),VLOOKUP(D167,DATA!$B$102:$N$125,5,FALSE),VLOOKUP(D167,DATA!$B$102:$N$125,6,FALSE),VLOOKUP(D167,DATA!$B$102:$N$125,7,FALSE),VLOOKUP(D167,DATA!$B$102:$N$125,8,FALSE),VLOOKUP(D167,DATA!$B$102:$N$125,9,FALSE),VLOOKUP(D167,DATA!$B$102:$N$125,10,FALSE),VLOOKUP(D167,DATA!$B$102:$N$125,11,FALSE),VLOOKUP(D167,DATA!$B$102:$N$125,12,FALSE),VLOOKUP(D167,DATA!$B$102:$N$125,13,FALSE),\"\")*(IF(F170=1,1,0))","v":0},{"$f":"利用申込書2!AG28","v":""}]
[null,{"$f":"TEXT(B167,\"YYYY\")","v":"1900"},null,null,"チェック2",{"$f":"IF(F167=1,1,IF(G168,1,2))","v":2},false,null,null,{"$f":"B170&$J$6","v":"0A"},{"$f":"B170&$K$6","v":"0P"},{"$f":"B170&$L$6","v":"0N"}]
[null,{"$f":"TEXT(B167,\"YYYYmm\")","v":"190001"},null,null,"チェック3",2,false,null,null,{"$f":"G168","v":false},{"$f":"G169","v":false},{"$f":"G170","v":false}]
[null,{"$f":"TEXT(B167,\"d\")","v":"0"},null,null,"チェック4",2,false]
[{"$f":"IF(D171=\"大会議室(準備)\",\"大会議室\",(IF(D171=\"大会議室(本番)\",\"大会議室\",(IF(D171=\"ピアザホール(準備)\",\"PH\",IF(D171=\"ピアザホール(本番)\",\"PH\",IF(D171=\"練習室(一般)\",\"練習室\",IF(D171=\"練習室(学生)\",\"練習室\",D171))))))))","v":0},{"$f":"IF(利用申込書3!A30=\"\",B167,利用申込書3!A30)","v":"00:00:00"},{"$f":"IF(OR((WEEKDAY(B171,2)>=6),COUNTIF(DATA!$Q$3:$T$23,B171)),2,1)","v":2},{"$f":"利用申込書3!F30","v":0},"チェック1",2,false,{"$f":"IF(AND($C$1=1,$C$2=1,C171=1),1,(IF(AND($C$1=1,$C$2=2,C171=1),2,(IF(AND($C$1=1,$C$2=3,C171=1),3,(IF(AND($C$1=2,$C$2=1,C171=1),4,(IF(AND($C$1=2,$C$2=2,C171=1),5,(IF(AND($C$1=2,$C$2=3,C171=1),6,(IF(AND($C$1=1,$C$2=1,C171=2),7,(IF(AND($C$1=1,$C$2=2,C171=2),8,(IF(AND($C$1=1,$C$2=3,C171=2),9,(IF(AND($C$1=2,$C$2=1,C171=2),10,(IF(AND($C$1=2,$C$2=2,C171=2),11,(IF(AND($C$1=2,$C$2=3,C171=2),12,\"\")))))))))))))))))))))))","v":7},{"$f":"CHOOSE(H171,VLOOKUP(D171,DATA!$B$2:$N$25,2,FALSE),VLOOKUP(D171,DATA!$B$2:$N$25,3,FALSE),VLOOKUP(D171,DATA!$B$2:$N$25,4,FALSE),VLOOKUP(D171,DATA!$B$2:$N$25,5,FALSE),VLOOKUP(D171,DATA!$B$2:$N$25,6,FALSE),VLOOKUP(D171,DATA!$B$2:$N$25,7,FALSE),VLOOKUP(D171,DATA!$B$2:$N$25,8,FALSE),VLOOKUP(D171,DATA!$B$2:$N$25,9,FALSE),VLOOKUP(D171,DATA!$B$2:$N$25,10,FALSE),VLOOKUP(D171,DATA!$B$2:$N$25,11,FALSE),VLOOKUP(D171,DATA!$B$2:$N$25,12,FALSE),VLOOKUP(D171,DATA!$B$2:$N$25,13,FALSE),\"\")*(IF(F171=1,1,0))","v":0},{"$f":"CHOOSE(H171,VLOOKUP(D171,DATA!$B$27:$N$50,2,FALSE),VLOOKUP(D171,DATA!$B$27:$N$50,3,FALSE),VLOOKUP(D171,DATA!$B$27:$N$50,4,FALSE),VLOOKUP(D171,DATA!$B$27:$N$50,5,FALSE),VLOOKUP(D171,DATA!$B$27:$N$50,6,FALSE),VLOOKUP(D171,DATA!$B$27:$N$50,7,FALSE),VLOOKUP(D171,DATA!$B$27:$N$50,8,FALSE),VLOOKUP(D171,DATA!$B$27:$N$50,9,FALSE),VLOOKUP(D171,DATA!$B$27:$N$50,10,FALSE),VLOOKUP(D171,DATA!$B$27:$N$50,11,FALSE),VLOOKUP(D171,DATA!$B$27:$N$50,12,FALSE),VLOOKUP(D171,DATA!$B$27:$N$50,13,FALSE),\"\")*(IF(F172=1,1,0))","v":0},{"$f":"CHOOSE(H171,VLOOKUP(D171,DATA!$B$52:$N$75,2,FALSE),VLOOKUP(D171,DATA!$B$52:$N$75,3,FALSE),VLOOKUP(D171,DATA!$B$52:$N$75,4,FALSE),VLOOKUP(D171,DATA!$B$52:$N$77,5,FALSE),VLOOKUP(D171,DATA!$B$52:$N$75,6,FALSE),VLOOKUP(D171,DATA!$B$52:$N$75,7,FALSE),VLOOKUP(D171,DATA!$B$52:$N$75,8,FALSE),VLOOKUP(D171,DATA!$B$52:$N$75,9,FALSE),VLOOKUP(D171,DATA!$B$52:$N$75,10,FALSE),VLOOKUP(D171,DATA!$B$52:$N$75,11,FALSE),VLOOKUP(D171,DATA!$B$52:$N$75,12,FALSE),VLOOKUP(D171,DATA!$B$52:$N$75,13,FALSE),\"\")*(IF(F173=1,1,0))","v":0},{"$f":"CHOOSE(H171,VLOOKUP(D171,DATA!$B$77:$N$100,2,FALSE),VLOOKUP(D171,DATA!$B$77:$N$100,3,FALSE),VLOOKUP(D171,DATA!$B$77:$N$100,4,FALSE),VLOOKUP(D171,DATA!$B$77:$N$100,5,FALSE),VLOOKUP(D171,DATA!$B$77:$N$100,6,FALSE),VLOOKUP(D171,DATA!$B$77:$N$100,7,FALSE),VLOOKUP(D171,DATA!$B$77:$N$100,8,FALSE),VLOOKUP(D171,DATA!$B$77:$N$100,9,FALSE),VLOOKUP(D171,DATA!$B$77:$N$100,10,FALSE),VLOOKUP(D171,DATA!$B$77:$N$100,11,FALSE),VLOOKUP(D171,DATA!$B$77:$N$100,12,FALSE),VLOOKUP(D171,DATA!$B$77:$N$100,13,FALSE),\"\")*(IF(F174=1,1,0))","v":0},{"$f":"CHOOSE(H171,VLOOKUP(D171,DATA!$B$102:$N$125,2,FALSE),VLOOKUP(D171,DATA!$B$102:$N$125,3,FALSE),VLOOKUP(D171,DATA!$B$102:$N$125,4,FALSE),VLOOKUP(D171,DATA!$B$102:$N$125,5,FALSE),VLOOKUP(D171,DATA!$B$102:$N$125,6,FALSE),VLOOKUP(D171,DATA!$B$102:$N$125,7,FALSE),VLOOKUP(D171,DATA!$B$102:$N$125,8,FALSE),VLOOKUP(D171,DATA!$B$102:$N$125,9,FALSE),VLOOKUP(D171,DATA!$B$102:$N$125,10,FALSE),VLOOKUP(D171,DATA!$B$102:$N$125,11,FALSE),VLOOKUP(D171,DATA!$B$102:$N$125,12,FALSE),VLOOKUP(D171,DATA!$B$102:$N$125,13,FALSE),\"\")*(IF(F174=1,1,0))","v":0},{"$f":"利用申込書2!AG30","v":""}]
[null,{"$f":"TEXT(B171,\"YYYY\")","v":"1900"},null,null,"チェック2",{"$f":"IF(F171=1,1,IF(G172,1,2))","v":2},false,null,null,{"$f":"B174&$J$6","v":"0A"},{"$f":"B174&$K$6","v":"0P"},{"$f":"B174&$L$6","v":"0N"}]
[null,{"$f":"TEXT(B171,\"YYYYmm\")","v":"190001"},null,null,"チェック3",2,false,null,null,{"$f":"G172","v":false},{"$f":"G173","v":false},{"$f":"G174","v":false}]
[null,{"$f":"TEXT(B171,\"d\")","v":"0"},null,null,"チェック4",2,false]
[{"$f":"IF(D175=\"大会議室(準備)\",\"大会議室\",(IF(D175=\"大会議室(本番)\",\"大会議室\",(IF(D175=\"ピアザホール(準備)\",\"PH\",IF(D175=\"ピアザホール(本番)\",\"PH\",IF(D175=\"練習室(一般)\",\"練習室\",IF(D175=\"練習室(学生)\",\"練習室\",D175))))))))","v":0},{"$f":"IF(利用申込書3!A32=\"\", B171,利用申込書3!A30)","v":"00:00:00"},{"$f":"IF(OR((WEEKDAY(B175,2)>=6),COUNTIF(DATA!$Q$3:$T$23,B175)),2,1)","v":2},{"$f":"利用申込書3!F32","v":0},"チェック1",2,false,{"$f":"IF(AND($C$1=1,$C$2=1,C175=1),1,(IF(AND($C$1=1,$C$2=2,C175=1),2,(IF(AND($C$1=1,$C$2=3,C175=1),3,(IF(AND($C$1=2,$C$2=1,C175=1),4,(IF(AND($C$1=2,$C$2=2,C175=1),5,(IF(AND($C$1=2,$C$2=3,C175=1),6,(IF(AND($C$1=1,$C$2=1,C175=2),7,(IF(AND($C$1=1,$C$2=2,C175=2),8,(IF(AND($C$1=1,$C$2=3,C175=2),9,(IF(AND($C$1=2,$C$2=1,C175=2),10,(IF(AND($C$1=2,$C$2=2,C175=2),11,(IF(AND($C$1=2,$C$2=3,C175=2),12,\"\")))))))))))))))))))))))","v":7},{"$f":"CHOOSE(H175,VLOOKUP(D175,DATA!$B$2:$N$25,2,FALSE),VLOOKUP(D175,DATA!$B$2:$N$25,3,FALSE),VLOOKUP(D175,DATA!$B$2:$N$25,4,FALSE),VLOOKUP(D175,DATA!$B$2:$N$25,5,FALSE),VLOOKUP(D175,DATA!$B$2:$N$25,6,FALSE),VLOOKUP(D175,DATA!$B$2:$N$25,7,FALSE),VLOOKUP(D175,DATA!$B$2:$N$25,8,FALSE),VLOOKUP(D175,DATA!$B$2:$N$25,9,FALSE),VLOOKUP(D175,DATA!$B$2:$N$25,10,FALSE),VLOOKUP(D175,DATA!$B$2:$N$25,11,FALSE),VLOOKUP(D175,DATA!$B$2:$N$25,12,FALSE),VLOOKUP(D175,DATA!$B$2:$N$25,13,FALSE),\"\")*(IF(F175=1,1,0))","v":0},{"$f":"CHOOSE(H175,VLOOKUP(D175,DATA!$B$27:$N$50,2,FALSE),VLOOKUP(D175,DATA!$B$27:$N$50,3,FALSE),VLOOKUP(D175,DATA!$B$27:$N$50,4,FALSE),VLOOKUP(D175,DATA!$B$27:$N$50,5,FALSE),VLOOKUP(D175,DATA!$B$27:$N$50,6,FALSE),VLOOKUP(D175,DATA!$B$27:$N$50,7,FALSE),VLOOKUP(D175,DATA!$B$27:$N$50,8,FALSE),VLOOKUP(D175,DATA!$B$27:$N$50,9,FALSE),VLOOKUP(D175,DATA!$B$27:$N$50,10,FALSE),VLOOKUP(D175,DATA!$B$27:$N$50,11,FALSE),VLOOKUP(D175,DATA!$B$27:$N$50,12,FALSE),VLOOKUP(D175,DATA!$B$27:$N$50,13,FALSE),\"\")*(IF(F176=1,1,0))","v":0},{"$f":"CHOOSE(H175,VLOOKUP(D175,DATA!$B$52:$N$75,2,FALSE),VLOOKUP(D175,DATA!$B$52:$N$75,3,FALSE),VLOOKUP(D175,DATA!$B$52:$N$75,4,FALSE),VLOOKUP(D175,DATA!$B$52:$N$77,5,FALSE),VLOOKUP(D175,DATA!$B$52:$N$75,6,FALSE),VLOOKUP(D175,DATA!$B$52:$N$75,7,FALSE),VLOOKUP(D175,DATA!$B$52:$N$75,8,FALSE),VLOOKUP(D175,DATA!$B$52:$N$75,9,FALSE),VLOOKUP(D175,DATA!$B$52:$N$75,10,FALSE),VLOOKUP(D175,DATA!$B$52:$N$75,11,FALSE),VLOOKUP(D175,DATA!$B$52:$N$75,12,FALSE),VLOOKUP(D175,DATA!$B$52:$N$75,13,FALSE),\"\")*(IF(F177=1,1,0))","v":0},{"$f":"CHOOSE(H175,VLOOKUP(D175,DATA!$B$77:$N$100,2,FALSE),VLOOKUP(D175,DATA!$B$77:$N$100,3,FALSE),VLOOKUP(D175,DATA!$B$77:$N$100,4,FALSE),VLOOKUP(D175,DATA!$B$77:$N$100,5,FALSE),VLOOKUP(D175,DATA!$B$77:$N$100,6,FALSE),VLOOKUP(D175,DATA!$B$77:$N$100,7,FALSE),VLOOKUP(D175,DATA!$B$77:$N$100,8,FALSE),VLOOKUP(D175,DATA!$B$77:$N$100,9,FALSE),VLOOKUP(D175,DATA!$B$77:$N$100,10,FALSE),VLOOKUP(D175,DATA!$B$77:$N$100,11,FALSE),VLOOKUP(D175,DATA!$B$77:$N$100,12,FALSE),VLOOKUP(D175,DATA!$B$77:$N$100,13,FALSE),\"\")*(IF(F178=1,1,0))","v":0},{"$f":"CHOOSE(H175,VLOOKUP(D175,DATA!$B$102:$N$125,2,FALSE),VLOOKUP(D175,DATA!$B$102:$N$125,3,FALSE),VLOOKUP(D175,DATA!$B$102:$N$125,4,FALSE),VLOOKUP(D175,DATA!$B$102:$N$125,5,FALSE),VLOOKUP(D175,DATA!$B$102:$N$125,6,FALSE),VLOOKUP(D175,DATA!$B$102:$N$125,7,FALSE),VLOOKUP(D175,DATA!$B$102:$N$125,8,FALSE),VLOOKUP(D175,DATA!$B$102:$N$125,9,FALSE),VLOOKUP(D175,DATA!$B$102:$N$125,10,FALSE),VLOOKUP(D175,DATA!$B$102:$N$125,11,FALSE),VLOOKUP(D175,DATA!$B$102:$N$125,12,FALSE),VLOOKUP(D175,DATA!$B$102:$N$125,13,FALSE),\"\")*(IF(F178=1,1,0))","v":0},{"$f":"利用申込書2!AG32","v":""}]
[null,{"$f":"TEXT(B175,\"YYYY\")","v":"1900"},null,null,"チェック2",{"$f":"IF(F175=1,1,IF(G176,1,2))","v":2},false,null,null,{"$f":"B178&$J$6","v":"0A"},{"$f":"B178&$K$6","v":"0P"},{"$f":"B178&$L$6","v":"0N"}]
[null,{"$f":"TEXT(B175,\"YYYYmm\")","v":"190001"},null,null,"チェック3",2,false,null,null,{"$f":"G176","v":false},{"$f":"G177","v":false},{"$f":"G178","v":false}]
[null,{"$f":"TEXT(B175,\"d\")","v":"0"},null,null,"チェック4",2,false]
[{"$f":"IF(D179=\"大会議室(準備)\",\"大会議室\",(IF(D179=\"大会議室(本番)\",\"大会議室\",(IF(D179=\"ピアザホール(準備)\",\"PH\",IF(D179=\"ピアザホール(本番)\",\"PH\",IF(D179=\"練習室(一般)\",\"練習室\",IF(D179=\"練習室(学生)\",\"練習室\",D179))))))))","v":0},{"$f":"IF(利用申込書3!A34=\"\", B175,利用申込書3!A34)","v":"00:00:00"},{"$f":"IF(OR((WEEKDAY(B179,2)>=6),COUNTIF(DATA!$Q$3:$T$23,B179)),2,1)","v":2},{"$f":"利用申込書3!F34","v":0},"チェック1",2,false,{"$f":"IF(AND($C$1=1,$C$2=1,C179=1),1,(IF(AND($C$1=1,$C$2=2,C179=1),2,(IF(AND($C$1=1,$C$2=3,C179=1),3,(IF(AND($C$1=2,$C$2=1,C179=1),4,(IF(AND($C$1=2,$C$2=2,C179=1),5,(IF(AND($C$1=2,$C$2=3,C179=1),6,(IF(AND($C$1=1,$C$2=1,C179=2),7,(IF(AND($C$1=1,$C$2=2,C179=2),8,(IF(AND($C$1=1,$C$2=3,C179=2),9,(IF(AND($C$1=2,$C$2=1,C179=2),10,(IF(AND($C$1=2,$C$2=2,C179=2),11,(IF(AND($C$1=2,$C$2=3,C179=2),12,\"\")))))))))))))))))))))))","v":7},{"$f":"CHOOSE(H179,VLOOKUP(D179,DATA!$B$2:$N$25,2,FALSE),VLOOKUP(D179,DATA!$B$2:$N$25,3,FALSE),VLOOKUP(D179,DATA!$B$2:$N$25,4,FALSE),VLOOKUP(D179,DATA!$B$2:$N$25,5,FALSE),VLOOKUP(D179,DATA!$B$2:$N$25,6,FALSE),VLOOKUP(D179,DATA!$B$2:$N$25,7,FALSE),VLOOKUP(D179,DATA!$B$2:$N$25,8,FALSE),VLOOKUP(D179,DATA!$B$2:$N$25,9,FALSE),VLOOKUP(D179,DATA!$B$2:$N$25,10,FALSE),VLOOKUP(D179,DATA!$B$2:$N$25,11,FALSE),VLOOKUP(D179,DATA!$B$2:$N$25,12,FALSE),VLOOKUP(D179,DATA!$B$2:$N$25,13,FALSE),\"\")*(IF(F179=1,1,0))","v":0},{"$f":"CHOOSE(H179,VLOOKUP(D179,DATA!$B$27:$N$50,2,FALSE),VLOOKUP(D179,DATA!$B$27:$N$50,3,FALSE),VLOOKUP(D179,DATA!$B$27:$N$50,4,FALSE),VLOOKUP(D179,DATA!$B$27:$N$50,5,FALSE),VLOOKUP(D179,DATA!$B$27:$N$50,6,FALSE),VLOOKUP(D179,DATA!$B$27:$N$50,7,FALSE),VLOOKUP(D179,DATA!$B$27:$N$50,8,FALSE),VLOOKUP(D179,DATA!$B$27:$N$50,9,FALSE),VLOOKUP(D179,DATA!$B$27:$N$50,10,FALSE),VLOOKUP(D179,DATA!$B$27:$N$50,11,FALSE),VLOOKUP(D179,DATA!$B$27:$N$50,12,FALSE),VLOOKUP(D179,DATA!$B$27:$N$50,13,FALSE),\"\")*(IF(F180=1,1,0))","v":0},{"$f":"CHOOSE(H179,VLOOKUP(D179,DATA!$B$52:$N$75,2,FALSE),VLOOKUP(D179,DATA!$B$52:$N$75,3,FALSE),VLOOKUP(D179,DATA!$B$52:$N$75,4,FALSE),VLOOKUP(D179,DATA!$B$52:$N$77,5,FALSE),VLOOKUP(D179,DATA!$B$52:$N$75,6,FALSE),VLOOKUP(D179,DATA!$B$52:$N$75,7,FALSE),VLOOKUP(D179,DATA!$B$52:$N$75,8,FALSE),VLOOKUP(D179,DATA!$B$52:$N$75,9,FALSE),VLOOKUP(D179,DATA!$B$52:$N$75,10,FALSE),VLOOKUP(D179,DATA!$B$52:$N$75,11,FALSE),VLOOKUP(D179,DATA!$B$52:$N$75,12,FALSE),VLOOKUP(D179,DATA!$B$52:$N$75,13,FALSE),\"\")*(IF(F181=1,1,0))","v":0},{"$f":"CHOOSE(H179,VLOOKUP(D179,DATA!$B$77:$N$100,2,FALSE),VLOOKUP(D179,DATA!$B$77:$N$100,3,FALSE),VLOOKUP(D179,DATA!$B$77:$N$100,4,FALSE),VLOOKUP(D179,DATA!$B$77:$N$100,5,FALSE),VLOOKUP(D179,DATA!$B$77:$N$100,6,FALSE),VLOOKUP(D179,DATA!$B$77:$N$100,7,FALSE),VLOOKUP(D179,DATA!$B$77:$N$100,8,FALSE),VLOOKUP(D179,DATA!$B$77:$N$100,9,FALSE),VLOOKUP(D179,DATA!$B$77:$N$100,10,FALSE),VLOOKUP(D179,DATA!$B$77:$N$100,11,FALSE),VLOOKUP(D179,DATA!$B$77:$N$100,12,FALSE),VLOOKUP(D179,DATA!$B$77:$N$100,13,FALSE),\"\")*(IF(F182=1,1,0))","v":0},{"$f":"CHOOSE(H179,VLOOKUP(D179,DATA!$B$102:$N$125,2,FALSE),VLOOKUP(D179,DATA!$B$102:$N$125,3,FALSE),VLOOKUP(D179,DATA!$B$102:$N$125,4,FALSE),VLOOKUP(D179,DATA!$B$102:$N$125,5,FALSE),VLOOKUP(D179,DATA!$B$102:$N$125,6,FALSE),VLOOKUP(D179,DATA!$B$102:$N$125,7,FALSE),VLOOKUP(D179,DATA!$B$102:$N$125,8,FALSE),VLOOKUP(D179,DATA!$B$102:$N$125,9,FALSE),VLOOKUP(D179,DATA!$B$102:$N$125,10,FALSE),VLOOKUP(D179,DATA!$B$102:$N$125,11,FALSE),VLOOKUP(D179,DATA!$B$102:$N$125,12,FALSE),VLOOKUP(D179,DATA!$B$102:$N$125,13,FALSE),\"\")*(IF(F182=1,1,0))","v":0},{"$f":"利用申込書2!AG34","v":""}]
[null,{"$f":"TEXT(B179,\"YYYY\")","v":"1900"},null,null,"チェック2",{"$f":"IF(F179=1,1,IF(G180,1,2))","v":2},false,null,null,{"$f":"B182&$J$6","v":"0A"},{"$f":"B182&$K$6","v":"0P"},{"$f":"B182&$L$6","v":"0N"}]
[null,{"$f":"TEXT(B179,\"YYYYmm\")","v":"190001"},null,null,"チェック3",2,false,null,null,{"$f":"G180","v":false},{"$f":"G181","v":false},{"$f":"G182","v":false}]
[null,{"$f":"TEXT(B179,\"d\")","v":"0"},null,null,"チェック4",2,false]
[{"$f":"IF(D183=\"大会議室(準備)\",\"大会議室\",(IF(D183=\"大会議室(本番)\",\"大会議室\",(IF(D183=\"ピアザホール(準備)\",\"PH\",IF(D183=\"ピアザホール(本番)\",\"PH\",IF(D183=\"練習室(一般)\",\"練習室\",IF(D183=\"練習室(学生)\",\"練習室\",D183))))))))","v":0},{"$f":"IF(利用申込書3!A36=\"\",B179,利用申込書3!A36)","v":"00:00:00"},{"$f":"IF(OR((WEEKDAY(B183,2)>=6),COUNTIF(DATA!$Q$3:$T$23,B183)),2,1)","v":2},{"$f":"利用申込書3!F36","v":0},"チェック1",2,false,{"$f":"IF(AND($C$1=1,$C$2=1,C183=1),1,(IF(AND($C$1=1,$C$2=2,C183=1),2,(IF(AND($C$1=1,$C$2=3,C183=1),3,(IF(AND($C$1=2,$C$2=1,C183=1),4,(IF(AND($C$1=2,$C$2=2,C183=1),5,(IF(AND($C$1=2,$C$2=3,C183=1),6,(IF(AND($C$1=1,$C$2=1,C183=2),7,(IF(AND($C$1=1,$C$2=2,C183=2),8,(IF(AND($C$1=1,$C$2=3,C183=2),9,(IF(AND($C$1=2,$C$2=1,C183=2),10,(IF(AND($C$1=2,$C$2=2,C183=2),11,(IF(AND($C$1=2,$C$2=3,C183=2),12,\"\")))))))))))))))))))))))","v":7},{"$f":"CHOOSE(H183,VLOOKUP(D183,DATA!$B$2:$N$25,2,FALSE),VLOOKUP(D183,DATA!$B$2:$N$25,3,FALSE),VLOOKUP(D183,DATA!$B$2:$N$25,4,FALSE),VLOOKUP(D183,DATA!$B$2:$N$25,5,FALSE),VLOOKUP(D183,DATA!$B$2:$N$25,6,FALSE),VLOOKUP(D183,DATA!$B$2:$N$25,7,FALSE),VLOOKUP(D183,DATA!$B$2:$N$25,8,FALSE),VLOOKUP(D183,DATA!$B$2:$N$25,9,FALSE),VLOOKUP(D183,DATA!$B$2:$N$25,10,FALSE),VLOOKUP(D183,DATA!$B$2:$N$25,11,FALSE),VLOOKUP(D183,DATA!$B$2:$N$25,12,FALSE),VLOOKUP(D183,DATA!$B$2:$N$25,13,FALSE),\"\")*(IF(F183=1,1,0))","v":0},{"$f":"CHOOSE(H183,VLOOKUP(D183,DATA!$B$27:$N$50,2,FALSE),VLOOKUP(D183,DATA!$B$27:$N$50,3,FALSE),VLOOKUP(D183,DATA!$B$27:$N$50,4,FALSE),VLOOKUP(D183,DATA!$B$27:$N$50,5,FALSE),VLOOKUP(D183,DATA!$B$27:$N$50,6,FALSE),VLOOKUP(D183,DATA!$B$27:$N$50,7,FALSE),VLOOKUP(D183,DATA!$B$27:$N$50,8,FALSE),VLOOKUP(D183,DATA!$B$27:$N$50,9,FALSE),VLOOKUP(D183,DATA!$B$27:$N$50,10,FALSE),VLOOKUP(D183,DATA!$B$27:$N$50,11,FALSE),VLOOKUP(D183,DATA!$B$27:$N$50,12,FALSE),VLOOKUP(D183,DATA!$B$27:$N$50,13,FALSE),\"\")*(IF(F184=1,1,0))","v":0},{"$f":"CHOOSE(H183,VLOOKUP(D183,DATA!$B$52:$N$75,2,FALSE),VLOOKUP(D183,DATA!$B$52:$N$75,3,FALSE),VLOOKUP(D183,DATA!$B$52:$N$75,4,FALSE),VLOOKUP(D183,DATA!$B$52:$N$77,5,FALSE),VLOOKUP(D183,DATA!$B$52:$N$75,6,FALSE),VLOOKUP(D183,DATA!$B$52:$N$75,7,FALSE),VLOOKUP(D183,DATA!$B$52:$N$75,8,FALSE),VLOOKUP(D183,DATA!$B$52:$N$75,9,FALSE),VLOOKUP(D183,DATA!$B$52:$N$75,10,FALSE),VLOOKUP(D183,DATA!$B$52:$N$75,11,FALSE),VLOOKUP(D183,DATA!$B$52:$N$75,12,FALSE),VLOOKUP(D183,DATA!$B$52:$N$75,13,FALSE),\"\")*(IF(F185=1,1,0))","v":0},{"$f":"CHOOSE(H183,VLOOKUP(D183,DATA!$B$77:$N$100,2,FALSE),VLOOKUP(D183,DATA!$B$77:$N$100,3,FALSE),VLOOKUP(D183,DATA!$B$77:$N$100,4,FALSE),VLOOKUP(D183,DATA!$B$77:$N$100,5,FALSE),VLOOKUP(D183,DATA!$B$77:$N$100,6,FALSE),VLOOKUP(D183,DATA!$B$77:$N$100,7,FALSE),VLOOKUP(D183,DATA!$B$77:$N$100,8,FALSE),VLOOKUP(D183,DATA!$B$77:$N$100,9,FALSE),VLOOKUP(D183,DATA!$B$77:$N$100,10,FALSE),VLOOKUP(D183,DATA!$B$77:$N$100,11,FALSE),VLOOKUP(D183,DATA!$B$77:$N$100,12,FALSE),VLOOKUP(D183,DATA!$B$77:$N$100,13,FALSE),\"\")*(IF(F186=1,1,0))","v":0},{"$f":"CHOOSE(H183,VLOOKUP(D183,DATA!$B$102:$N$125,2,FALSE),VLOOKUP(D183,DATA!$B$102:$N$125,3,FALSE),VLOOKUP(D183,DATA!$B$102:$N$125,4,FALSE),VLOOKUP(D183,DATA!$B$102:$N$125,5,FALSE),VLOOKUP(D183,DATA!$B$102:$N$125,6,FALSE),VLOOKUP(D183,DATA!$B$102:$N$125,7,FALSE),VLOOKUP(D183,DATA!$B$102:$N$125,8,FALSE),VLOOKUP(D183,DATA!$B$102:$N$125,9,FALSE),VLOOKUP(D183,DATA!$B$102:$N$125,10,FALSE),VLOOKUP(D183,DATA!$B$102:$N$125,11,FALSE),VLOOKUP(D183,DATA!$B$102:$N$125,12,FALSE),VLOOKUP(D183,DATA!$B$102:$N$125,13,FALSE),\"\")*(IF(F186=1,1,0))","v":0},{"$f":"利用申込書2!AG36","v":""}]
[null,{"$f":"TEXT(B183,\"YYYY\")","v":"1900"},null,null,"チェック2",{"$f":"IF(F183=1,1,IF(G184,1,2))","v":2},false,null,null,{"$f":"B186&$J$6","v":"0A"},{"$f":"B186&$K$6","v":"0P"},{"$f":"B186&$L$6","v":"0N"}]
[null,{"$f":"TEXT(B183,\"YYYYmm\")","v":"190001"},null,null,"チェック3",2,false,null,null,{"$f":"G184","v":false},{"$f":"G185","v":false},{"$f":"G186","v":false}]
[null,{"$f":"TEXT(B183,\"d\")","v":"0"},null,null,"チェック4",2,false]
[{"$f":"IF(D187=\"大会議室(準備)\",\"大会議室\",(IF(D187=\"大会議室(本番)\",\"大会議室\",(IF(D187=\"ピアザホール(準備)\",\"PH\",IF(D187=\"ピアザホール(本番)\",\"PH\",IF(D187=\"練習室(一般)\",\"練習室\",IF(D187=\"練習室(学生)\",\"練習室\",D187))))))))","v":0},{"$f":"IF(利用申込書3!A38=\"\",B183,利用申込書3!A38)","v":"00:00:00"},{"$f":"IF(OR((WEEKDAY(B187,2)>=6),COUNTIF(DATA!$Q$3:$T$23,B187)),2,1)","v":2},{"$f":"利用申込書3!F38","v":0},"チェック1",2,false,{"$f":"IF(AND($C$1=1,$C$2=1,C187=1),1,(IF(AND($C$1=1,$C$2=2,C187=1),2,(IF(AND($C$1=1,$C$2=3,C187=1),3,(IF(AND($C$1=2,$C$2=1,C187=1),4,(IF(AND($C$1=2,$C$2=2,C187=1),5,(IF(AND($C$1=2,$C$2=3,C187=1),6,(IF(AND($C$1=1,$C$2=1,C187=2),7,(IF(AND($C$1=1,$C$2=2,C187=2),8,(IF(AND($C$1=1,$C$2=3,C187=2),9,(IF(AND($C$1=2,$C$2=1,C187=2),10,(IF(AND($C$1=2,$C$2=2,C187=2),11,(IF(AND($C$1=2,$C$2=3,C187=2),12,\"\")))))))))))))))))))))))","v":7},{"$f":"CHOOSE(H187,VLOOKUP(D187,DATA!$B$2:$N$25,2,FALSE),VLOOKUP(D187,DATA!$B$2:$N$25,3,FALSE),VLOOKUP(D187,DATA!$B$2:$N$25,4,FALSE),VLOOKUP(D187,DATA!$B$2:$N$25,5,FALSE),VLOOKUP(D187,DATA!$B$2:$N$25,6,FALSE),VLOOKUP(D187,DATA!$B$2:$N$25,7,FALSE),VLOOKUP(D187,DATA!$B$2:$N$25,8,FALSE),VLOOKUP(D187,DATA!$B$2:$N$25,9,FALSE),VLOOKUP(D187,DATA!$B$2:$N$25,10,FALSE),VLOOKUP(D187,DATA!$B$2:$N$25,11,FALSE),VLOOKUP(D187,DATA!$B$2:$N$25,12,FALSE),VLOOKUP(D187,DATA!$B$2:$N$25,13,FALSE),\"\")*(IF(F187=1,1,0))","v":0},{"$f":"CHOOSE(H187,VLOOKUP(D187,DATA!$B$27:$N$50,2,FALSE),VLOOKUP(D187,DATA!$B$27:$N$50,3,FALSE),VLOOKUP(D187,DATA!$B$27:$N$50,4,FALSE),VLOOKUP(D187,DATA!$B$27:$N$50,5,FALSE),VLOOKUP(D187,DATA!$B$27:$N$50,6,FALSE),VLOOKUP(D187,DATA!$B$27:$N$50,7,FALSE),VLOOKUP(D187,DATA!$B$27:$N$50,8,FALSE),VLOOKUP(D187,DATA!$B$27:$N$50,9,FALSE),VLOOKUP(D187,DATA!$B$27:$N$50,10,FALSE),VLOOKUP(D187,DATA!$B$27:$N$50,11,FALSE),VLOOKUP(D187,DATA!$B$27:$N$50,12,FALSE),VLOOKUP(D187,DATA!$B$27:$N$50,13,FALSE),\"\")*(IF(F188=1,1,0))","v":0},{"$f":"CHOOSE(H187,VLOOKUP(D187,DATA!$B$52:$N$75,2,FALSE),VLOOKUP(D187,DATA!$B$52:$N$75,3,FALSE),VLOOKUP(D187,DATA!$B$52:$N$75,4,FALSE),VLOOKUP(D187,DATA!$B$52:$N$77,5,FALSE),VLOOKUP(D187,DATA!$B$52:$N$75,6,FALSE),VLOOKUP(D187,DATA!$B$52:$N$75,7,FALSE),VLOOKUP(D187,DATA!$B$52:$N$75,8,FALSE),VLOOKUP(D187,DATA!$B$52:$N$75,9,FALSE),VLOOKUP(D187,DATA!$B$52:$N$75,10,FALSE),VLOOKUP(D187,DATA!$B$52:$N$75,11,FALSE),VLOOKUP(D187,DATA!$B$52:$N$75,12,FALSE),VLOOKUP(D187,DATA!$B$52:$N$75,13,FALSE),\"\")*(IF(F189=1,1,0))","v":0},{"$f":"CHOOSE(H187,VLOOKUP(D187,DATA!$B$77:$N$100,2,FALSE),VLOOKUP(D187,DATA!$B$77:$N$100,3,FALSE),VLOOKUP(D187,DATA!$B$77:$N$100,4,FALSE),VLOOKUP(D187,DATA!$B$77:$N$100,5,FALSE),VLOOKUP(D187,DATA!$B$77:$N$100,6,FALSE),VLOOKUP(D187,DATA!$B$77:$N$100,7,FALSE),VLOOKUP(D187,DATA!$B$77:$N$100,8,FALSE),VLOOKUP(D187,DATA!$B$77:$N$100,9,FALSE),VLOOKUP(D187,DATA!$B$77:$N$100,10,FALSE),VLOOKUP(D187,DATA!$B$77:$N$100,11,FALSE),VLOOKUP(D187,DATA!$B$77:$N$100,12,FALSE),VLOOKUP(D187,DATA!$B$77:$N$100,13,FALSE),\"\")*(IF(F190=1,1,0))","v":0},{"$f":"CHOOSE(H187,VLOOKUP(D187,DATA!$B$102:$N$125,2,FALSE),VLOOKUP(D187,DATA!$B$102:$N$125,3,FALSE),VLOOKUP(D187,DATA!$B$102:$N$125,4,FALSE),VLOOKUP(D187,DATA!$B$102:$N$125,5,FALSE),VLOOKUP(D187,DATA!$B$102:$N$125,6,FALSE),VLOOKUP(D187,DATA!$B$102:$N$125,7,FALSE),VLOOKUP(D187,DATA!$B$102:$N$125,8,FALSE),VLOOKUP(D187,DATA!$B$102:$N$125,9,FALSE),VLOOKUP(D187,DATA!$B$102:$N$125,10,FALSE),VLOOKUP(D187,DATA!$B$102:$N$125,11,FALSE),VLOOKUP(D187,DATA!$B$102:$N$125,12,FALSE),VLOOKUP(D187,DATA!$B$102:$N$125,13,FALSE),\"\")*(IF(F190=1,1,0))","v":0},{"$f":"利用申込書2!AG38","v":""}]
[null,{"$f":"TEXT(B187,\"YYYY\")","v":"1900"},null,null,"チェック2",{"$f":"IF(F187=1,1,IF(G188,1,2))","v":2},false,null,null,{"$f":"B190&$J$6","v":"0A"},{"$f":"B190&$K$6","v":"0P"},{"$f":"B190&$L$6","v":"0N"}]
[null,{"$f":"TEXT(B187,\"YYYYmm\")","v":"190001"},null,null,"チェック3",2,false,null,null,{"$f":"G188","v":false},{"$f":"G189","v":false},{"$f":"G190","v":false}]
[null,{"$f":"TEXT(B187,\"d\")","v":"0"},null,null,"チェック4",2,false]
[{"$f":"IF(D191=\"大会議室(準備)\",\"大会議室\",(IF(D191=\"大会議室(本番)\",\"大会議室\",(IF(D191=\"ピアザホール(準備)\",\"PH\",IF(D191=\"ピアザホール(本番)\",\"PH\",IF(D191=\"練習室(一般)\",\"練習室\",IF(D191=\"練習室(学生)\",\"練習室\",D191))))))))","v":0},{"$f":"IF(利用申込書3!A40=\"\",B187,利用申込書3!A40)","v":"00:00:00"},{"$f":"IF(OR((WEEKDAY(B191,2)>=6),COUNTIF(DATA!$Q$3:$T$23,B191)),2,1)","v":2},{"$f":"利用申込書3!F40","v":0},"チェック1",2,false,{"$f":"IF(AND($C$1=1,$C$2=1,C191=1),1,(IF(AND($C$1=1,$C$2=2,C191=1),2,(IF(AND($C$1=1,$C$2=3,C191=1),3,(IF(AND($C$1=2,$C$2=1,C191=1),4,(IF(AND($C$1=2,$C$2=2,C191=1),5,(IF(AND($C$1=2,$C$2=3,C191=1),6,(IF(AND($C$1=1,$C$2=1,C191=2),7,(IF(AND($C$1=1,$C$2=2,C191=2),8,(IF(AND($C$1=1,$C$2=3,C191=2),9,(IF(AND($C$1=2,$C$2=1,C191=2),10,(IF(AND($C$1=2,$C$2=2,C191=2),11,(IF(AND($C$1=2,$C$2=3,C191=2),12,\"\")))))))))))))))))))))))","v":7},{"$f":"CHOOSE(H191,VLOOKUP(D191,DATA!$B$2:$N$25,2,FALSE),VLOOKUP(D191,DATA!$B$2:$N$25,3,FALSE),VLOOKUP(D191,DATA!$B$2:$N$25,4,FALSE),VLOOKUP(D191,DATA!$B$2:$N$25,5,FALSE),VLOOKUP(D191,DATA!$B$2:$N$25,6,FALSE),VLOOKUP(D191,DATA!$B$2:$N$25,7,FALSE),VLOOKUP(D191,DATA!$B$2:$N$25,8,FALSE),VLOOKUP(D191,DATA!$B$2:$N$25,9,FALSE),VLOOKUP(D191,DATA!$B$2:$N$25,10,FALSE),VLOOKUP(D191,DATA!$B$2:$N$25,11,FALSE),VLOOKUP(D191,DATA!$B$2:$N$25,12,FALSE),VLOOKUP(D191,DATA!$B$2:$N$25,13,FALSE),\"\")*(IF(F191=1,1,0))","v":0},{"$f":"CHOOSE(H191,VLOOKUP(D191,DATA!$B$27:$N$50,2,FALSE),VLOOKUP(D191,DATA!$B$27:$N$50,3,FALSE),VLOOKUP(D191,DATA!$B$27:$N$50,4,FALSE),VLOOKUP(D191,DATA!$B$27:$N$50,5,FALSE),VLOOKUP(D191,DATA!$B$27:$N$50,6,FALSE),VLOOKUP(D191,DATA!$B$27:$N$50,7,FALSE),VLOOKUP(D191,DATA!$B$27:$N$50,8,FALSE),VLOOKUP(D191,DATA!$B$27:$N$50,9,FALSE),VLOOKUP(D191,DATA!$B$27:$N$50,10,FALSE),VLOOKUP(D191,DATA!$B$27:$N$50,11,FALSE),VLOOKUP(D191,DATA!$B$27:$N$50,12,FALSE),VLOOKUP(D191,DATA!$B$27:$N$50,13,FALSE),\"\")*(IF(F192=1,1,0))","v":0},{"$f":"CHOOSE(H191,VLOOKUP(D191,DATA!$B$52:$N$75,2,FALSE),VLOOKUP(D191,DATA!$B$52:$N$75,3,FALSE),VLOOKUP(D191,DATA!$B$52:$N$75,4,FALSE),VLOOKUP(D191,DATA!$B$52:$N$77,5,FALSE),VLOOKUP(D191,DATA!$B$52:$N$75,6,FALSE),VLOOKUP(D191,DATA!$B$52:$N$75,7,FALSE),VLOOKUP(D191,DATA!$B$52:$N$75,8,FALSE),VLOOKUP(D191,DATA!$B$52:$N$75,9,FALSE),VLOOKUP(D191,DATA!$B$52:$N$75,10,FALSE),VLOOKUP(D191,DATA!$B$52:$N$75,11,FALSE),VLOOKUP(D191,DATA!$B$52:$N$75,12,FALSE),VLOOKUP(D191,DATA!$B$52:$N$75,13,FALSE),\"\")*(IF(F193=1,1,0))","v":0},{"$f":"CHOOSE(H191,VLOOKUP(D191,DATA!$B$77:$N$100,2,FALSE),VLOOKUP(D191,DATA!$B$77:$N$100,3,FALSE),VLOOKUP(D191,DATA!$B$77:$N$100,4,FALSE),VLOOKUP(D191,DATA!$B$77:$N$100,5,FALSE),VLOOKUP(D191,DATA!$B$77:$N$100,6,FALSE),VLOOKUP(D191,DATA!$B$77:$N$100,7,FALSE),VLOOKUP(D191,DATA!$B$77:$N$100,8,FALSE),VLOOKUP(D191,DATA!$B$77:$N$100,9,FALSE),VLOOKUP(D191,DATA!$B$77:$N$100,10,FALSE),VLOOKUP(D191,DATA!$B$77:$N$100,11,FALSE),VLOOKUP(D191,DATA!$B$77:$N$100,12,FALSE),VLOOKUP(D191,DATA!$B$77:$N$100,13,FALSE),\"\")*(IF(F194=1,1,0))","v":0},{"$f":"CHOOSE(H191,VLOOKUP(D191,DATA!$B$102:$N$125,2,FALSE),VLOOKUP(D191,DATA!$B$102:$N$125,3,FALSE),VLOOKUP(D191,DATA!$B$102:$N$125,4,FALSE),VLOOKUP(D191,DATA!$B$102:$N$125,5,FALSE),VLOOKUP(D191,DATA!$B$102:$N$125,6,FALSE),VLOOKUP(D191,DATA!$B$102:$N$125,7,FALSE),VLOOKUP(D191,DATA!$B$102:$N$125,8,FALSE),VLOOKUP(D191,DATA!$B$102:$N$125,9,FALSE),VLOOKUP(D191,DATA!$B$102:$N$125,10,FALSE),VLOOKUP(D191,DATA!$B$102:$N$125,11,FALSE),VLOOKUP(D191,DATA!$B$102:$N$125,12,FALSE),VLOOKUP(D191,DATA!$B$102:$N$125,13,FALSE),\"\")*(IF(F194=1,1,0))","v":0},{"$f":"利用申込書2!AG40","v":""}]
[null,{"$f":"TEXT(B191,\"YYYY\")","v":"1900"},null,null,"チェック2",{"$f":"IF(F191=1,1,IF(G192,1,2))","v":2},false,null,null,{"$f":"B194&$J$6","v":"0A"},{"$f":"B194&$K$6","v":"0P"},{"$f":"B194&$L$6","v":"0N"}]
[null,{"$f":"TEXT(B191,\"YYYYmm\")","v":"190001"},null,null,"チェック3",2,false,null,null,{"$f":"G192","v":false},{"$f":"G193","v":false},{"$f":"G194","v":false}]
[null,{"$f":"TEXT(B191,\"d\")","v":"0"},null,null,"チェック4",2,false]
[{"$f":"IF(D195=\"大会議室(準備)\",\"大会議室\",(IF(D195=\"大会議室(本番)\",\"大会議室\",(IF(D195=\"ピアザホール(準備)\",\"PH\",IF(D195=\"ピアザホール(本番)\",\"PH\",IF(D195=\"練習室(一般)\",\"練習室\",IF(D195=\"練習室(学生)\",\"練習室\",D195))))))))","v":0},{"$f":"IF(利用申込書3!A42=\"\",B191,利用申込書3!A42)","v":"00:00:00"},{"$f":"IF(OR((WEEKDAY(B195,2)>=6),COUNTIF(DATA!$Q$3:$T$23,B195)),2,1)","v":2},{"$f":"利用申込書3!F42","v":0},"チェック1",2,false,{"$f":"IF(AND($C$1=1,$C$2=1,C195=1),1,(IF(AND($C$1=1,$C$2=2,C195=1),2,(IF(AND($C$1=1,$C$2=3,C195=1),3,(IF(AND($C$1=2,$C$2=1,C195=1),4,(IF(AND($C$1=2,$C$2=2,C195=1),5,(IF(AND($C$1=2,$C$2=3,C195=1),6,(IF(AND($C$1=1,$C$2=1,C195=2),7,(IF(AND($C$1=1,$C$2=2,C195=2),8,(IF(AND($C$1=1,$C$2=3,C195=2),9,(IF(AND($C$1=2,$C$2=1,C195=2),10,(IF(AND($C$1=2,$C$2=2,C195=2),11,(IF(AND($C$1=2,$C$2=3,C195=2),12,\"\")))))))))))))))))))))))","v":7},{"$f":"CHOOSE(H195,VLOOKUP(D195,DATA!$B$2:$N$25,2,FALSE),VLOOKUP(D195,DATA!$B$2:$N$25,3,FALSE),VLOOKUP(D195,DATA!$B$2:$N$25,4,FALSE),VLOOKUP(D195,DATA!$B$2:$N$25,5,FALSE),VLOOKUP(D195,DATA!$B$2:$N$25,6,FALSE),VLOOKUP(D195,DATA!$B$2:$N$25,7,FALSE),VLOOKUP(D195,DATA!$B$2:$N$25,8,FALSE),VLOOKUP(D195,DATA!$B$2:$N$25,9,FALSE),VLOOKUP(D195,DATA!$B$2:$N$25,10,FALSE),VLOOKUP(D195,DATA!$B$2:$N$25,11,FALSE),VLOOKUP(D195,DATA!$B$2:$N$25,12,FALSE),VLOOKUP(D195,DATA!$B$2:$N$25,13,FALSE),\"\")*(IF(F195=1,1,0))","v":0},{"$f":"CHOOSE(H195,VLOOKUP(D195,DATA!$B$27:$N$50,2,FALSE),VLOOKUP(D195,DATA!$B$27:$N$50,3,FALSE),VLOOKUP(D195,DATA!$B$27:$N$50,4,FALSE),VLOOKUP(D195,DATA!$B$27:$N$50,5,FALSE),VLOOKUP(D195,DATA!$B$27:$N$50,6,FALSE),VLOOKUP(D195,DATA!$B$27:$N$50,7,FALSE),VLOOKUP(D195,DATA!$B$27:$N$50,8,FALSE),VLOOKUP(D195,DATA!$B$27:$N$50,9,FALSE),VLOOKUP(D195,DATA!$B$27:$N$50,10,FALSE),VLOOKUP(D195,DATA!$B$27:$N$50,11,FALSE),VLOOKUP(D195,DATA!$B$27:$N$50,12,FALSE),VLOOKUP(D195,DATA!$B$27:$N$50,13,FALSE),\"\")*(IF(F196=1,1,0))","v":0},{"$f":"CHOOSE(H195,VLOOKUP(D195,DATA!$B$52:$N$75,2,FALSE),VLOOKUP(D195,DATA!$B$52:$N$75,3,FALSE),VLOOKUP(D195,DATA!$B$52:$N$75,4,FALSE),VLOOKUP(D195,DATA!$B$52:$N$77,5,FALSE),VLOOKUP(D195,DATA!$B$52:$N$75,6,FALSE),VLOOKUP(D195,DATA!$B$52:$N$75,7,FALSE),VLOOKUP(D195,DATA!$B$52:$N$75,8,FALSE),VLOOKUP(D195,DATA!$B$52:$N$75,9,FALSE),VLOOKUP(D195,DATA!$B$52:$N$75,10,FALSE),VLOOKUP(D195,DATA!$B$52:$N$75,11,FALSE),VLOOKUP(D195,DATA!$B$52:$N$75,12,FALSE),VLOOKUP(D195,DATA!$B$52:$N$75,13,FALSE),\"\")*(IF(F197=1,1,0))","v":0},{"$f":"CHOOSE(H195,VLOOKUP(D195,DATA!$B$77:$N$100,2,FALSE),VLOOKUP(D195,DATA!$B$77:$N$100,3,FALSE),VLOOKUP(D195,DATA!$B$77:$N$100,4,FALSE),VLOOKUP(D195,DATA!$B$77:$N$100,5,FALSE),VLOOKUP(D195,DATA!$B$77:$N$100,6,FALSE),VLOOKUP(D195,DATA!$B$77:$N$100,7,FALSE),VLOOKUP(D195,DATA!$B$77:$N$100,8,FALSE),VLOOKUP(D195,DATA!$B$77:$N$100,9,FALSE),VLOOKUP(D195,DATA!$B$77:$N$100,10,FALSE),VLOOKUP(D195,DATA!$B$77:$N$100,11,FALSE),VLOOKUP(D195,DATA!$B$77:$N$100,12,FALSE),VLOOKUP(D195,DATA!$B$77:$N$100,13,FALSE),\"\")*(IF(F198=1,1,0))","v":0},{"$f":"CHOOSE(H195,VLOOKUP(D195,DATA!$B$102:$N$125,2,FALSE),VLOOKUP(D195,DATA!$B$102:$N$125,3,FALSE),VLOOKUP(D195,DATA!$B$102:$N$125,4,FALSE),VLOOKUP(D195,DATA!$B$102:$N$125,5,FALSE),VLOOKUP(D195,DATA!$B$102:$N$125,6,FALSE),VLOOKUP(D195,DATA!$B$102:$N$125,7,FALSE),VLOOKUP(D195,DATA!$B$102:$N$125,8,FALSE),VLOOKUP(D195,DATA!$B$102:$N$125,9,FALSE),VLOOKUP(D195,DATA!$B$102:$N$125,10,FALSE),VLOOKUP(D195,DATA!$B$102:$N$125,11,FALSE),VLOOKUP(D195,DATA!$B$102:$N$125,12,FALSE),VLOOKUP(D195,DATA!$B$102:$N$125,13,FALSE),\"\")*(IF(F198=1,1,0))","v":0},{"$f":"利用申込書2!AG42","v":""}]
[null,{"$f":"TEXT(B195,\"YYYY\")","v":"1900"},null,null,"チェック2",{"$f":"IF(F195=1,1,IF(G196,1,2))","v":2},false,null,null,{"$f":"B198&$J$6","v":"0A"},{"$f":"B198&$K$6","v":"0P"},{"$f":"B198&$L$6","v":"0N"}]
[null,{"$f":"TEXT(B195,\"YYYYmm\")","v":"190001"},null,null,"チェック3",{"$f":"IF(G197,1,2)","v":2},false,null,null,{"$f":"G196","v":false},{"$f":"G197","v":false},{"$f":"G198","v":false}]
[null,{"$f":"TEXT(B195,\"d\")","v":"0"},null,null,"チェック4",2,false]
[{"$f":"IF(D199=\"大会議室(準備)\",\"大会議室\",(IF(D199=\"大会議室(本番)\",\"大会議室\",(IF(D199=\"ピアザホール(準備)\",\"PH\",IF(D199=\"ピアザホール(本番)\",\"PH\",IF(D199=\"練習室(一般)\",\"練習室\",IF(D199=\"練習室(学生)\",\"練習室\",D199))))))))","v":0},{"$f":"IF(利用申込書3!A44=\"\",B195,利用申込書3!A44)","v":"00:00:00"},{"$f":"IF(OR((WEEKDAY(B199,2)>=6),COUNTIF(DATA!$Q$3:$T$23,B199)),2,1)","v":2},{"$f":"利用申込書3!F44","v":0},"チェック1",2,false,{"$f":"IF(AND($C$1=1,$C$2=1,C199=1),1,(IF(AND($C$1=1,$C$2=2,C199=1),2,(IF(AND($C$1=1,$C$2=3,C199=1),3,(IF(AND($C$1=2,$C$2=1,C199=1),4,(IF(AND($C$1=2,$C$2=2,C199=1),5,(IF(AND($C$1=2,$C$2=3,C199=1),6,(IF(AND($C$1=1,$C$2=1,C199=2),7,(IF(AND($C$1=1,$C$2=2,C199=2),8,(IF(AND($C$1=1,$C$2=3,C199=2),9,(IF(AND($C$1=2,$C$2=1,C199=2),10,(IF(AND($C$1=2,$C$2=2,C199=2),11,(IF(AND($C$1=2,$C$2=3,C199=2),12,\"\")))))))))))))))))))))))","v":7},{"$f":"CHOOSE(H199,VLOOKUP(D199,DATA!$B$2:$N$25,2,FALSE),VLOOKUP(D199,DATA!$B$2:$N$25,3,FALSE),VLOOKUP(D199,DATA!$B$2:$N$25,4,FALSE),VLOOKUP(D199,DATA!$B$2:$N$25,5,FALSE),VLOOKUP(D199,DATA!$B$2:$N$25,6,FALSE),VLOOKUP(D199,DATA!$B$2:$N$25,7,FALSE),VLOOKUP(D199,DATA!$B$2:$N$25,8,FALSE),VLOOKUP(D199,DATA!$B$2:$N$25,9,FALSE),VLOOKUP(D199,DATA!$B$2:$N$25,10,FALSE),VLOOKUP(D199,DATA!$B$2:$N$25,11,FALSE),VLOOKUP(D199,DATA!$B$2:$N$25,12,FALSE),VLOOKUP(D199,DATA!$B$2:$N$25,13,FALSE),\"\")*(IF(F199=1,1,0))","v":0},{"$f":"CHOOSE(H199,VLOOKUP(D199,DATA!$B$27:$N$50,2,FALSE),VLOOKUP(D199,DATA!$B$27:$N$50,3,FALSE),VLOOKUP(D199,DATA!$B$27:$N$50,4,FALSE),VLOOKUP(D199,DATA!$B$27:$N$50,5,FALSE),VLOOKUP(D199,DATA!$B$27:$N$50,6,FALSE),VLOOKUP(D199,DATA!$B$27:$N$50,7,FALSE),VLOOKUP(D199,DATA!$B$27:$N$50,8,FALSE),VLOOKUP(D199,DATA!$B$27:$N$50,9,FALSE),VLOOKUP(D199,DATA!$B$27:$N$50,10,FALSE),VLOOKUP(D199,DATA!$B$27:$N$50,11,FALSE),VLOOKUP(D199,DATA!$B$27:$N$50,12,FALSE),VLOOKUP(D199,DATA!$B$27:$N$50,13,FALSE),\"\")*(IF(F200=1,1,0))","v":0},{"$f":"CHOOSE(H199,VLOOKUP(D199,DATA!$B$52:$N$75,2,FALSE),VLOOKUP(D199,DATA!$B$52:$N$75,3,FALSE),VLOOKUP(D199,DATA!$B$52:$N$75,4,FALSE),VLOOKUP(D199,DATA!$B$52:$N$77,5,FALSE),VLOOKUP(D199,DATA!$B$52:$N$75,6,FALSE),VLOOKUP(D199,DATA!$B$52:$N$75,7,FALSE),VLOOKUP(D199,DATA!$B$52:$N$75,8,FALSE),VLOOKUP(D199,DATA!$B$52:$N$75,9,FALSE),VLOOKUP(D199,DATA!$B$52:$N$75,10,FALSE),VLOOKUP(D199,DATA!$B$52:$N$75,11,FALSE),VLOOKUP(D199,DATA!$B$52:$N$75,12,FALSE),VLOOKUP(D199,DATA!$B$52:$N$75,13,FALSE),\"\")*(IF(F201=1,1,0))","v":0},{"$f":"CHOOSE(H199,VLOOKUP(D199,DATA!$B$77:$N$100,2,FALSE),VLOOKUP(D199,DATA!$B$77:$N$100,3,FALSE),VLOOKUP(D199,DATA!$B$77:$N$100,4,FALSE),VLOOKUP(D199,DATA!$B$77:$N$100,5,FALSE),VLOOKUP(D199,DATA!$B$77:$N$100,6,FALSE),VLOOKUP(D199,DATA!$B$77:$N$100,7,FALSE),VLOOKUP(D199,DATA!$B$77:$N$100,8,FALSE),VLOOKUP(D199,DATA!$B$77:$N$100,9,FALSE),VLOOKUP(D199,DATA!$B$77:$N$100,10,FALSE),VLOOKUP(D199,DATA!$B$77:$N$100,11,FALSE),VLOOKUP(D199,DATA!$B$77:$N$100,12,FALSE),VLOOKUP(D199,DATA!$B$77:$N$100,13,FALSE),\"\")*(IF(F202=1,1,0))","v":0},{"$f":"CHOOSE(H199,VLOOKUP(D199,DATA!$B$102:$N$125,2,FALSE),VLOOKUP(D199,DATA!$B$102:$N$125,3,FALSE),VLOOKUP(D199,DATA!$B$102:$N$125,4,FALSE),VLOOKUP(D199,DATA!$B$102:$N$125,5,FALSE),VLOOKUP(D199,DATA!$B$102:$N$125,6,FALSE),VLOOKUP(D199,DATA!$B$102:$N$125,7,FALSE),VLOOKUP(D199,DATA!$B$102:$N$125,8,FALSE),VLOOKUP(D199,DATA!$B$102:$N$125,9,FALSE),VLOOKUP(D199,DATA!$B$102:$N$125,10,FALSE),VLOOKUP(D199,DATA!$B$102:$N$125,11,FALSE),VLOOKUP(D199,DATA!$B$102:$N$125,12,FALSE),VLOOKUP(D199,DATA!$B$102:$N$125,13,FALSE),\"\")*(IF(F202=1,1,0))","v":0},{"$f":"利用申込書2!AG44","v":""}]
[null,{"$f":"TEXT(B199,\"YYYY\")","v":"1900"},null,null,"チェック2",{"$f":"IF(F199=1,1,IF(G200,1,2))","v":2},false,null,null,{"$f":"B202&$J$6","v":"0A"},{"$f":"B202&$K$6","v":"0P"},{"$f":"B202&$L$6","v":"0N"}]
[null,{"$f":"TEXT(B199,\"YYYYmm\")","v":"190001"},null,null,"チェック3",2,false,null,null,{"$f":"G200","v":false},{"$f":"G201","v":false},{"$f":"G202","v":false}]
[null,{"$f":"TEXT(B199,\"d\")","v":"0"},null,null,"チェック4",2,false]
[{"$f":"IF(D203=\"大会議室(準備)\",\"大会議室\",(IF(D203=\"大会議室(本番)\",\"大会議室\",(IF(D203=\"ピアザホール(準備)\",\"PH\",IF(D203=\"ピアザホール(本番)\",\"PH\",IF(D203=\"練習室(一般)\",\"練習室\",IF(D203=\"練習室(学生)\",\"練習室\",D203))))))))","v":0},{"$f":"IF(利用申込書3!A46=\"\",B199,利用申込書3!A46)","v":"00:00:00"},{"$f":"IF(OR((WEEKDAY(B203,2)>=6),COUNTIF(DATA!$Q$3:$T$23,B203)),2,1)","v":2},{"$f":"利用申込書3!F46","v":0},"チェック1",2,false,{"$f":"IF(AND($C$1=1,$C$2=1,C203=1),1,(IF(AND($C$1=1,$C$2=2,C203=1),2,(IF(AND($C$1=1,$C$2=3,C203=1),3,(IF(AND($C$1=2,$C$2=1,C203=1),4,(IF(AND($C$1=2,$C$2=2,C203=1),5,(IF(AND($C$1=2,$C$2=3,C203=1),6,(IF(AND($C$1=1,$C$2=1,C203=2),7,(IF(AND($C$1=1,$C$2=2,C203=2),8,(IF(AND($C$1=1,$C$2=3,C203=2),9,(IF(AND($C$1=2,$C$2=1,C203=2),10,(IF(AND($C$1=2,$C$2=2,C203=2),11,(IF(AND($C$1=2,$C$2=3,C203=2),12,\"\")))))))))))))))))))))))","v":7},{"$f":"CHOOSE(H203,VLOOKUP(D203,DATA!$B$2:$N$25,2,FALSE),VLOOKUP(D203,DATA!$B$2:$N$25,3,FALSE),VLOOKUP(D203,DATA!$B$2:$N$25,4,FALSE),VLOOKUP(D203,DATA!$B$2:$N$25,5,FALSE),VLOOKUP(D203,DATA!$B$2:$N$25,6,FALSE),VLOOKUP(D203,DATA!$B$2:$N$25,7,FALSE),VLOOKUP(D203,DATA!$B$2:$N$25,8,FALSE),VLOOKUP(D203,DATA!$B$2:$N$25,9,FALSE),VLOOKUP(D203,DATA!$B$2:$N$25,10,FALSE),VLOOKUP(D203,DATA!$B$2:$N$25,11,FALSE),VLOOKUP(D203,DATA!$B$2:$N$25,12,FALSE),VLOOKUP(D203,DATA!$B$2:$N$25,13,FALSE),\"\")*(IF(F203=1,1,0))","v":0},{"$f":"CHOOSE(H203,VLOOKUP(D203,DATA!$B$27:$N$50,2,FALSE),VLOOKUP(D203,DATA!$B$27:$N$50,3,FALSE),VLOOKUP(D203,DATA!$B$27:$N$50,4,FALSE),VLOOKUP(D203,DATA!$B$27:$N$50,5,FALSE),VLOOKUP(D203,DATA!$B$27:$N$50,6,FALSE),VLOOKUP(D203,DATA!$B$27:$N$50,7,FALSE),VLOOKUP(D203,DATA!$B$27:$N$50,8,FALSE),VLOOKUP(D203,DATA!$B$27:$N$50,9,FALSE),VLOOKUP(D203,DATA!$B$27:$N$50,10,FALSE),VLOOKUP(D203,DATA!$B$27:$N$50,11,FALSE),VLOOKUP(D203,DATA!$B$27:$N$50,12,FALSE),VLOOKUP(D203,DATA!$B$27:$N$50,13,FALSE),\"\")*(IF(F204=1,1,0))","v":0},{"$f":"CHOOSE(H203,VLOOKUP(D203,DATA!$B$52:$N$75,2,FALSE),VLOOKUP(D203,DATA!$B$52:$N$75,3,FALSE),VLOOKUP(D203,DATA!$B$52:$N$75,4,FALSE),VLOOKUP(D203,DATA!$B$52:$N$77,5,FALSE),VLOOKUP(D203,DATA!$B$52:$N$75,6,FALSE),VLOOKUP(D203,DATA!$B$52:$N$75,7,FALSE),VLOOKUP(D203,DATA!$B$52:$N$75,8,FALSE),VLOOKUP(D203,DATA!$B$52:$N$75,9,FALSE),VLOOKUP(D203,DATA!$B$52:$N$75,10,FALSE),VLOOKUP(D203,DATA!$B$52:$N$75,11,FALSE),VLOOKUP(D203,DATA!$B$52:$N$75,12,FALSE),VLOOKUP(D203,DATA!$B$52:$N$75,13,FALSE),\"\")*(IF(F205=1,1,0))","v":0},{"$f":"CHOOSE(H203,VLOOKUP(D203,DATA!$B$77:$N$100,2,FALSE),VLOOKUP(D203,DATA!$B$77:$N$100,3,FALSE),VLOOKUP(D203,DATA!$B$77:$N$100,4,FALSE),VLOOKUP(D203,DATA!$B$77:$N$100,5,FALSE),VLOOKUP(D203,DATA!$B$77:$N$100,6,FALSE),VLOOKUP(D203,DATA!$B$77:$N$100,7,FALSE),VLOOKUP(D203,DATA!$B$77:$N$100,8,FALSE),VLOOKUP(D203,DATA!$B$77:$N$100,9,FALSE),VLOOKUP(D203,DATA!$B$77:$N$100,10,FALSE),VLOOKUP(D203,DATA!$B$77:$N$100,11,FALSE),VLOOKUP(D203,DATA!$B$77:$N$100,12,FALSE),VLOOKUP(D203,DATA!$B$77:$N$100,13,FALSE),\"\")*(IF(F206=1,1,0))","v":0},{"$f":"CHOOSE(H203,VLOOKUP(D203,DATA!$B$102:$N$125,2,FALSE),VLOOKUP(D203,DATA!$B$102:$N$125,3,FALSE),VLOOKUP(D203,DATA!$B$102:$N$125,4,FALSE),VLOOKUP(D203,DATA!$B$102:$N$125,5,FALSE),VLOOKUP(D203,DATA!$B$102:$N$125,6,FALSE),VLOOKUP(D203,DATA!$B$102:$N$125,7,FALSE),VLOOKUP(D203,DATA!$B$102:$N$125,8,FALSE),VLOOKUP(D203,DATA!$B$102:$N$125,9,FALSE),VLOOKUP(D203,DATA!$B$102:$N$125,10,FALSE),VLOOKUP(D203,DATA!$B$102:$N$125,11,FALSE),VLOOKUP(D203,DATA!$B$102:$N$125,12,FALSE),VLOOKUP(D203,DATA!$B$102:$N$125,13,FALSE),\"\")*(IF(F206=1,1,0))","v":0},{"$f":"利用申込書2!AG46","v":""}]
[null,{"$f":"TEXT(B203,\"YYYY\")","v":"1900"},null,null,"チェック2",{"$f":"IF(F203=1,1,IF(G204,1,2))","v":2},false,null,null,{"$f":"B206&$J$6","v":"0A"},{"$f":"B206&$K$6","v":"0P"},{"$f":"B206&$L$6","v":"0N"}]
[null,{"$f":"TEXT(B203,\"YYYYmm\")","v":"190001"},null,null,"チェック3",2,false,null,null,{"$f":"G204","v":false},{"$f":"G205","v":false},{"$f":"G206","v":false}]
[null,{"$f":"TEXT(B203,\"d\")","v":"0"},null,null,"チェック4",2,false]
[{"$f":"IF(D207=\"大会議室(準備)\",\"大会議室\",(IF(D207=\"大会議室(本番)\",\"大会議室\",(IF(D207=\"ピアザホール(準備)\",\"PH\",IF(D207=\"ピアザホール(本番)\",\"PH\",IF(D207=\"練習室(一般)\",\"練習室\",IF(D207=\"練習室(学生)\",\"練習室\",D207))))))))","v":0},{"$f":"IF(利用申込書3!A48=\"\",B203,利用申込書3!A48)","v":"00:00:00"},{"$f":"IF(OR((WEEKDAY(B207,2)>=6),COUNTIF(DATA!$Q$3:$T$23,B207)),2,1)","v":2},{"$f":"利用申込書3!F48","v":0},"チェック1",2,false,{"$f":"IF(AND($C$1=1,$C$2=1,C207=1),1,(IF(AND($C$1=1,$C$2=2,C207=1),2,(IF(AND($C$1=1,$C$2=3,C207=1),3,(IF(AND($C$1=2,$C$2=1,C207=1),4,(IF(AND($C$1=2,$C$2=2,C207=1),5,(IF(AND($C$1=2,$C$2=3,C207=1),6,(IF(AND($C$1=1,$C$2=1,C207=2),7,(IF(AND($C$1=1,$C$2=2,C207=2),8,(IF(AND($C$1=1,$C$2=3,C207=2),9,(IF(AND($C$1=2,$C$2=1,C207=2),10,(IF(AND($C$1=2,$C$2=2,C207=2),11,(IF(AND($C$1=2,$C$2=3,C207=2),12,\"\")))))))))))))))))))))))","v":7},{"$f":"CHOOSE(H207,VLOOKUP(D207,DATA!$B$2:$N$25,2,FALSE),VLOOKUP(D207,DATA!$B$2:$N$25,3,FALSE),VLOOKUP(D207,DATA!$B$2:$N$25,4,FALSE),VLOOKUP(D207,DATA!$B$2:$N$25,5,FALSE),VLOOKUP(D207,DATA!$B$2:$N$25,6,FALSE),VLOOKUP(D207,DATA!$B$2:$N$25,7,FALSE),VLOOKUP(D207,DATA!$B$2:$N$25,8,FALSE),VLOOKUP(D207,DATA!$B$2:$N$25,9,FALSE),VLOOKUP(D207,DATA!$B$2:$N$25,10,FALSE),VLOOKUP(D207,DATA!$B$2:$N$25,11,FALSE),VLOOKUP(D207,DATA!$B$2:$N$25,12,FALSE),VLOOKUP(D207,DATA!$B$2:$N$25,13,FALSE),\"\")*(IF(F207=1,1,0))","v":0},{"$f":"CHOOSE(H207,VLOOKUP(D207,DATA!$B$27:$N$50,2,FALSE),VLOOKUP(D207,DATA!$B$27:$N$50,3,FALSE),VLOOKUP(D207,DATA!$B$27:$N$50,4,FALSE),VLOOKUP(D207,DATA!$B$27:$N$50,5,FALSE),VLOOKUP(D207,DATA!$B$27:$N$50,6,FALSE),VLOOKUP(D207,DATA!$B$27:$N$50,7,FALSE),VLOOKUP(D207,DATA!$B$27:$N$50,8,FALSE),VLOOKUP(D207,DATA!$B$27:$N$50,9,FALSE),VLOOKUP(D207,DATA!$B$27:$N$50,10,FALSE),VLOOKUP(D207,DATA!$B$27:$N$50,11,FALSE),VLOOKUP(D207,DATA!$B$27:$N$50,12,FALSE),VLOOKUP(D207,DATA!$B$27:$N$50,13,FALSE),\"\")*(IF(F208=1,1,0))","v":0},{"$f":"CHOOSE(H207,VLOOKUP(D207,DATA!$B$52:$N$75,2,FALSE),VLOOKUP(D207,DATA!$B$52:$N$75,3,FALSE),VLOOKUP(D207,DATA!$B$52:$N$75,4,FALSE),VLOOKUP(D207,DATA!$B$52:$N$77,5,FALSE),VLOOKUP(D207,DATA!$B$52:$N$75,6,FALSE),VLOOKUP(D207,DATA!$B$52:$N$75,7,FALSE),VLOOKUP(D207,DATA!$B$52:$N$75,8,FALSE),VLOOKUP(D207,DATA!$B$52:$N$75,9,FALSE),VLOOKUP(D207,DATA!$B$52:$N$75,10,FALSE),VLOOKUP(D207,DATA!$B$52:$N$75,11,FALSE),VLOOKUP(D207,DATA!$B$52:$N$75,12,FALSE),VLOOKUP(D207,DATA!$B$52:$N$75,13,FALSE),\"\")*(IF(F209=1,1,0))","v":0},{"$f":"CHOOSE(H207,VLOOKUP(D207,DATA!$B$77:$N$100,2,FALSE),VLOOKUP(D207,DATA!$B$77:$N$100,3,FALSE),VLOOKUP(D207,DATA!$B$77:$N$100,4,FALSE),VLOOKUP(D207,DATA!$B$77:$N$100,5,FALSE),VLOOKUP(D207,DATA!$B$77:$N$100,6,FALSE),VLOOKUP(D207,DATA!$B$77:$N$100,7,FALSE),VLOOKUP(D207,DATA!$B$77:$N$100,8,FALSE),VLOOKUP(D207,DATA!$B$77:$N$100,9,FALSE),VLOOKUP(D207,DATA!$B$77:$N$100,10,FALSE),VLOOKUP(D207,DATA!$B$77:$N$100,11,FALSE),VLOOKUP(D207,DATA!$B$77:$N$100,12,FALSE),VLOOKUP(D207,DATA!$B$77:$N$100,13,FALSE),\"\")*(IF(F210=1,1,0))","v":0},{"$f":"CHOOSE(H207,VLOOKUP(D207,DATA!$B$102:$N$125,2,FALSE),VLOOKUP(D207,DATA!$B$102:$N$125,3,FALSE),VLOOKUP(D207,DATA!$B$102:$N$125,4,FALSE),VLOOKUP(D207,DATA!$B$102:$N$125,5,FALSE),VLOOKUP(D207,DATA!$B$102:$N$125,6,FALSE),VLOOKUP(D207,DATA!$B$102:$N$125,7,FALSE),VLOOKUP(D207,DATA!$B$102:$N$125,8,FALSE),VLOOKUP(D207,DATA!$B$102:$N$125,9,FALSE),VLOOKUP(D207,DATA!$B$102:$N$125,10,FALSE),VLOOKUP(D207,DATA!$B$102:$N$125,11,FALSE),VLOOKUP(D207,DATA!$B$102:$N$125,12,FALSE),VLOOKUP(D207,DATA!$B$102:$N$125,13,FALSE),\"\")*(IF(F210=1,1,0))","v":0},{"$f":"利用申込書2!AG48","v":""}]
[null,{"$f":"TEXT(B207,\"YYYY\")","v":"1900"},null,null,"チェック2",{"$f":"IF(F207=1,1,IF(G208,1,2))","v":2},false,null,null,{"$f":"B210&$J$6","v":"0A"},{"$f":"B210&$K$6","v":"0P"},{"$f":"B210&$L$6","v":"0N"}]
[null,{"$f":"TEXT(B207,\"YYYYmm\")","v":"190001"},null,null,"チェック3",2,false,null,null,{"$f":"G208","v":false},{"$f":"G209","v":false},{"$f":"G210","v":false}]
[null,{"$f":"TEXT(B207,\"d\")","v":"0"},null,null,"チェック4",2,false]
[{"$f":"IF(D211=\"大会議室(準備)\",\"大会議室\",(IF(D211=\"大会議室(本番)\",\"大会議室\",(IF(D211=\"ピアザホール(準備)\",\"PH\",IF(D211=\"ピアザホール(本番)\",\"PH\",IF(D211=\"練習室(一般)\",\"練習室\",IF(D211=\"練習室(学生)\",\"練習室\",D211))))))))","v":0},{"$f":"IF(利用申込書3!A50=\"\",B207,利用申込書3!A50)","v":"00:00:00"},{"$f":"IF(OR((WEEKDAY(B211,2)>=6),COUNTIF(DATA!$Q$3:$T$23,B211)),2,1)","v":2},{"$f":"利用申込書3!F50","v":0},"チェック1",2,false,{"$f":"IF(AND($C$1=1,$C$2=1,C211=1),1,(IF(AND($C$1=1,$C$2=2,C211=1),2,(IF(AND($C$1=1,$C$2=3,C211=1),3,(IF(AND($C$1=2,$C$2=1,C211=1),4,(IF(AND($C$1=2,$C$2=2,C211=1),5,(IF(AND($C$1=2,$C$2=3,C211=1),6,(IF(AND($C$1=1,$C$2=1,C211=2),7,(IF(AND($C$1=1,$C$2=2,C211=2),8,(IF(AND($C$1=1,$C$2=3,C211=2),9,(IF(AND($C$1=2,$C$2=1,C211=2),10,(IF(AND($C$1=2,$C$2=2,C211=2),11,(IF(AND($C$1=2,$C$2=3,C211=2),12,\"\")))))))))))))))))))))))","v":7},{"$f":"CHOOSE(H211,VLOOKUP(D211,DATA!$B$2:$N$25,2,FALSE),VLOOKUP(D211,DATA!$B$2:$N$25,3,FALSE),VLOOKUP(D211,DATA!$B$2:$N$25,4,FALSE),VLOOKUP(D211,DATA!$B$2:$N$25,5,FALSE),VLOOKUP(D211,DATA!$B$2:$N$25,6,FALSE),VLOOKUP(D211,DATA!$B$2:$N$25,7,FALSE),VLOOKUP(D211,DATA!$B$2:$N$25,8,FALSE),VLOOKUP(D211,DATA!$B$2:$N$25,9,FALSE),VLOOKUP(D211,DATA!$B$2:$N$25,10,FALSE),VLOOKUP(D211,DATA!$B$2:$N$25,11,FALSE),VLOOKUP(D211,DATA!$B$2:$N$25,12,FALSE),VLOOKUP(D211,DATA!$B$2:$N$25,13,FALSE),\"\")*(IF(F211=1,1,0))","v":0},{"$f":"CHOOSE(H211,VLOOKUP(D211,DATA!$B$27:$N$50,2,FALSE),VLOOKUP(D211,DATA!$B$27:$N$50,3,FALSE),VLOOKUP(D211,DATA!$B$27:$N$50,4,FALSE),VLOOKUP(D211,DATA!$B$27:$N$50,5,FALSE),VLOOKUP(D211,DATA!$B$27:$N$50,6,FALSE),VLOOKUP(D211,DATA!$B$27:$N$50,7,FALSE),VLOOKUP(D211,DATA!$B$27:$N$50,8,FALSE),VLOOKUP(D211,DATA!$B$27:$N$50,9,FALSE),VLOOKUP(D211,DATA!$B$27:$N$50,10,FALSE),VLOOKUP(D211,DATA!$B$27:$N$50,11,FALSE),VLOOKUP(D211,DATA!$B$27:$N$50,12,FALSE),VLOOKUP(D211,DATA!$B$27:$N$50,13,FALSE),\"\")*(IF(F212=1,1,0))","v":0},{"$f":"CHOOSE(H211,VLOOKUP(D211,DATA!$B$52:$N$75,2,FALSE),VLOOKUP(D211,DATA!$B$52:$N$75,3,FALSE),VLOOKUP(D211,DATA!$B$52:$N$75,4,FALSE),VLOOKUP(D211,DATA!$B$52:$N$77,5,FALSE),VLOOKUP(D211,DATA!$B$52:$N$75,6,FALSE),VLOOKUP(D211,DATA!$B$52:$N$75,7,FALSE),VLOOKUP(D211,DATA!$B$52:$N$75,8,FALSE),VLOOKUP(D211,DATA!$B$52:$N$75,9,FALSE),VLOOKUP(D211,DATA!$B$52:$N$75,10,FALSE),VLOOKUP(D211,DATA!$B$52:$N$75,11,FALSE),VLOOKUP(D211,DATA!$B$52:$N$75,12,FALSE),VLOOKUP(D211,DATA!$B$52:$N$75,13,FALSE),\"\")*(IF(F213=1,1,0))","v":0},{"$f":"CHOOSE(H211,VLOOKUP(D211,DATA!$B$77:$N$100,2,FALSE),VLOOKUP(D211,DATA!$B$77:$N$100,3,FALSE),VLOOKUP(D211,DATA!$B$77:$N$100,4,FALSE),VLOOKUP(D211,DATA!$B$77:$N$100,5,FALSE),VLOOKUP(D211,DATA!$B$77:$N$100,6,FALSE),VLOOKUP(D211,DATA!$B$77:$N$100,7,FALSE),VLOOKUP(D211,DATA!$B$77:$N$100,8,FALSE),VLOOKUP(D211,DATA!$B$77:$N$100,9,FALSE),VLOOKUP(D211,DATA!$B$77:$N$100,10,FALSE),VLOOKUP(D211,DATA!$B$77:$N$100,11,FALSE),VLOOKUP(D211,DATA!$B$77:$N$100,12,FALSE),VLOOKUP(D211,DATA!$B$77:$N$100,13,FALSE),\"\")*(IF(F214=1,1,0))","v":0},{"$f":"CHOOSE(H211,VLOOKUP(D211,DATA!$B$102:$N$125,2,FALSE),VLOOKUP(D211,DATA!$B$102:$N$125,3,FALSE),VLOOKUP(D211,DATA!$B$102:$N$125,4,FALSE),VLOOKUP(D211,DATA!$B$102:$N$125,5,FALSE),VLOOKUP(D211,DATA!$B$102:$N$125,6,FALSE),VLOOKUP(D211,DATA!$B$102:$N$125,7,FALSE),VLOOKUP(D211,DATA!$B$102:$N$125,8,FALSE),VLOOKUP(D211,DATA!$B$102:$N$125,9,FALSE),VLOOKUP(D211,DATA!$B$102:$N$125,10,FALSE),VLOOKUP(D211,DATA!$B$102:$N$125,11,FALSE),VLOOKUP(D211,DATA!$B$102:$N$125,12,FALSE),VLOOKUP(D211,DATA!$B$102:$N$125,13,FALSE),\"\")*(IF(F214=1,1,0))","v":0},{"$f":"利用申込書2!AG50","v":""}]
[null,{"$f":"TEXT(B211,\"YYYY\")","v":"1900"},null,null,"チェック2",{"$f":"IF(F211=1,1,IF(G212,1,2))","v":2},false,null,null,{"$f":"B214&$J$6","v":"0A"},{"$f":"B214&$K$6","v":"0P"},{"$f":"B214&$L$6","v":"0N"}]
[null,{"$f":"TEXT(B211,\"YYYYmm\")","v":"190001"},null,null,"チェック3",2,false,null,null,{"$f":"G212","v":false},{"$f":"G213","v":false},{"$f":"G214","v":false}]
[null,{"$f":"TEXT(B211,\"d\")","v":"0"},null,null,"チェック4",2,false]
[{"$f":"IF(D215=\"大会議室(準備)\",\"大会議室\",(IF(D215=\"大会議室(本番)\",\"大会議室\",(IF(D215=\"ピアザホール(準備)\",\"PH\",IF(D215=\"ピアザホール(本番)\",\"PH\",IF(D215=\"練習室(一般)\",\"練習室\",IF(D215=\"練習室(学生)\",\"練習室\",D215))))))))","v":0},{"$f":"IF(利用申込書3!A52=\"\",B211,利用申込書3!A52)","v":"00:00:00"},{"$f":"IF(OR((WEEKDAY(B215,2)>=6),COUNTIF(DATA!$Q$3:$T$23,B215)),2,1)","v":2},{"$f":"利用申込書3!F52","v":0},"チェック1",2,false,{"$f":"IF(AND($C$1=1,$C$2=1,C215=1),1,(IF(AND($C$1=1,$C$2=2,C215=1),2,(IF(AND($C$1=1,$C$2=3,C215=1),3,(IF(AND($C$1=2,$C$2=1,C215=1),4,(IF(AND($C$1=2,$C$2=2,C215=1),5,(IF(AND($C$1=2,$C$2=3,C215=1),6,(IF(AND($C$1=1,$C$2=1,C215=2),7,(IF(AND($C$1=1,$C$2=2,C215=2),8,(IF(AND($C$1=1,$C$2=3,C215=2),9,(IF(AND($C$1=2,$C$2=1,C215=2),10,(IF(AND($C$1=2,$C$2=2,C215=2),11,(IF(AND($C$1=2,$C$2=3,C215=2),12,\"\")))))))))))))))))))))))","v":7},{"$f":"CHOOSE(H215,VLOOKUP(D215,DATA!$B$2:$N$25,2,FALSE),VLOOKUP(D215,DATA!$B$2:$N$25,3,FALSE),VLOOKUP(D215,DATA!$B$2:$N$25,4,FALSE),VLOOKUP(D215,DATA!$B$2:$N$25,5,FALSE),VLOOKUP(D215,DATA!$B$2:$N$25,6,FALSE),VLOOKUP(D215,DATA!$B$2:$N$25,7,FALSE),VLOOKUP(D215,DATA!$B$2:$N$25,8,FALSE),VLOOKUP(D215,DATA!$B$2:$N$25,9,FALSE),VLOOKUP(D215,DATA!$B$2:$N$25,10,FALSE),VLOOKUP(D215,DATA!$B$2:$N$25,11,FALSE),VLOOKUP(D215,DATA!$B$2:$N$25,12,FALSE),VLOOKUP(D215,DATA!$B$2:$N$25,13,FALSE),\"\")*(IF(F215=1,1,0))","v":0},{"$f":"CHOOSE(H215,VLOOKUP(D215,DATA!$B$27:$N$50,2,FALSE),VLOOKUP(D215,DATA!$B$27:$N$50,3,FALSE),VLOOKUP(D215,DATA!$B$27:$N$50,4,FALSE),VLOOKUP(D215,DATA!$B$27:$N$50,5,FALSE),VLOOKUP(D215,DATA!$B$27:$N$50,6,FALSE),VLOOKUP(D215,DATA!$B$27:$N$50,7,FALSE),VLOOKUP(D215,DATA!$B$27:$N$50,8,FALSE),VLOOKUP(D215,DATA!$B$27:$N$50,9,FALSE),VLOOKUP(D215,DATA!$B$27:$N$50,10,FALSE),VLOOKUP(D215,DATA!$B$27:$N$50,11,FALSE),VLOOKUP(D215,DATA!$B$27:$N$50,12,FALSE),VLOOKUP(D215,DATA!$B$27:$N$50,13,FALSE),\"\")*(IF(F216=1,1,0))","v":0},{"$f":"CHOOSE(H215,VLOOKUP(D215,DATA!$B$52:$N$75,2,FALSE),VLOOKUP(D215,DATA!$B$52:$N$75,3,FALSE),VLOOKUP(D215,DATA!$B$52:$N$75,4,FALSE),VLOOKUP(D215,DATA!$B$52:$N$77,5,FALSE),VLOOKUP(D215,DATA!$B$52:$N$75,6,FALSE),VLOOKUP(D215,DATA!$B$52:$N$75,7,FALSE),VLOOKUP(D215,DATA!$B$52:$N$75,8,FALSE),VLOOKUP(D215,DATA!$B$52:$N$75,9,FALSE),VLOOKUP(D215,DATA!$B$52:$N$75,10,FALSE),VLOOKUP(D215,DATA!$B$52:$N$75,11,FALSE),VLOOKUP(D215,DATA!$B$52:$N$75,12,FALSE),VLOOKUP(D215,DATA!$B$52:$N$75,13,FALSE),\"\")*(IF(F217=1,1,0))","v":0},{"$f":"CHOOSE(H215,VLOOKUP(D215,DATA!$B$77:$N$100,2,FALSE),VLOOKUP(D215,DATA!$B$77:$N$100,3,FALSE),VLOOKUP(D215,DATA!$B$77:$N$100,4,FALSE),VLOOKUP(D215,DATA!$B$77:$N$100,5,FALSE),VLOOKUP(D215,DATA!$B$77:$N$100,6,FALSE),VLOOKUP(D215,DATA!$B$77:$N$100,7,FALSE),VLOOKUP(D215,DATA!$B$77:$N$100,8,FALSE),VLOOKUP(D215,DATA!$B$77:$N$100,9,FALSE),VLOOKUP(D215,DATA!$B$77:$N$100,10,FALSE),VLOOKUP(D215,DATA!$B$77:$N$100,11,FALSE),VLOOKUP(D215,DATA!$B$77:$N$100,12,FALSE),VLOOKUP(D215,DATA!$B$77:$N$100,13,FALSE),\"\")*(IF(F218=1,1,0))","v":0},{"$f":"CHOOSE(H215,VLOOKUP(D215,DATA!$B$102:$N$125,2,FALSE),VLOOKUP(D215,DATA!$B$102:$N$125,3,FALSE),VLOOKUP(D215,DATA!$B$102:$N$125,4,FALSE),VLOOKUP(D215,DATA!$B$102:$N$125,5,FALSE),VLOOKUP(D215,DATA!$B$102:$N$125,6,FALSE),VLOOKUP(D215,DATA!$B$102:$N$125,7,FALSE),VLOOKUP(D215,DATA!$B$102:$N$125,8,FALSE),VLOOKUP(D215,DATA!$B$102:$N$125,9,FALSE),VLOOKUP(D215,DATA!$B$102:$N$125,10,FALSE),VLOOKUP(D215,DATA!$B$102:$N$125,11,FALSE),VLOOKUP(D215,DATA!$B$102:$N$125,12,FALSE),VLOOKUP(D215,DATA!$B$102:$N$125,13,FALSE),\"\")*(IF(F218=1,1,0))","v":0},{"$f":"利用申込書2!AG52","v":""}]
[null,{"$f":"TEXT(B215,\"YYYY\")","v":"1900"},null,null,"チェック2",{"$f":"IF(F215=1,1,IF(G216,1,2))","v":2},false,null,null,{"$f":"B218&$J$6","v":"0A"},{"$f":"B218&$K$6","v":"0P"},{"$f":"B218&$L$6","v":"0N"}]
[null,{"$f":"TEXT(B215,\"YYYYmm\")","v":"190001"},null,null,"チェック3",2,false,null,null,{"$f":"G216","v":false},{"$f":"G217","v":false},{"$f":"G218","v":false}]
[null,{"$f":"TEXT(B215,\"d\")","v":"0"},null,null,"チェック4",2,false]
[{"$f":"IF(D219=\"大会議室(準備)\",\"大会議室\",(IF(D219=\"大会議室(本番)\",\"大会議室\",(IF(D219=\"ピアザホール(準備)\",\"PH\",IF(D219=\"ピアザホール(本番)\",\"PH\",IF(D219=\"練習室(一般)\",\"練習室\",IF(D219=\"練習室(学生)\",\"練習室\",D219))))))))","v":0},{"$f":"IF(利用申込書3!A54=\"\",B215,利用申込書3!A54)","v":"00:00:00"},{"$f":"IF(OR((WEEKDAY(B219,2)>=6),COUNTIF(DATA!$Q$3:$T$23,B219)),2,1)","v":2},{"$f":"利用申込書3!F54","v":0},"チェック1",2,false,{"$f":"IF(AND($C$1=1,$C$2=1,C219=1),1,(IF(AND($C$1=1,$C$2=2,C219=1),2,(IF(AND($C$1=1,$C$2=3,C219=1),3,(IF(AND($C$1=2,$C$2=1,C219=1),4,(IF(AND($C$1=2,$C$2=2,C219=1),5,(IF(AND($C$1=2,$C$2=3,C219=1),6,(IF(AND($C$1=1,$C$2=1,C219=2),7,(IF(AND($C$1=1,$C$2=2,C219=2),8,(IF(AND($C$1=1,$C$2=3,C219=2),9,(IF(AND($C$1=2,$C$2=1,C219=2),10,(IF(AND($C$1=2,$C$2=2,C219=2),11,(IF(AND($C$1=2,$C$2=3,C219=2),12,\"\")))))))))))))))))))))))","v":7},{"$f":"CHOOSE(H219,VLOOKUP(D219,DATA!$B$2:$N$25,2,FALSE),VLOOKUP(D219,DATA!$B$2:$N$25,3,FALSE),VLOOKUP(D219,DATA!$B$2:$N$25,4,FALSE),VLOOKUP(D219,DATA!$B$2:$N$25,5,FALSE),VLOOKUP(D219,DATA!$B$2:$N$25,6,FALSE),VLOOKUP(D219,DATA!$B$2:$N$25,7,FALSE),VLOOKUP(D219,DATA!$B$2:$N$25,8,FALSE),VLOOKUP(D219,DATA!$B$2:$N$25,9,FALSE),VLOOKUP(D219,DATA!$B$2:$N$25,10,FALSE),VLOOKUP(D219,DATA!$B$2:$N$25,11,FALSE),VLOOKUP(D219,DATA!$B$2:$N$25,12,FALSE),VLOOKUP(D219,DATA!$B$2:$N$25,13,FALSE),\"\")*(IF(F219=1,1,0))","v":0},{"$f":"CHOOSE(H219,VLOOKUP(D219,DATA!$B$27:$N$50,2,FALSE),VLOOKUP(D219,DATA!$B$27:$N$50,3,FALSE),VLOOKUP(D219,DATA!$B$27:$N$50,4,FALSE),VLOOKUP(D219,DATA!$B$27:$N$50,5,FALSE),VLOOKUP(D219,DATA!$B$27:$N$50,6,FALSE),VLOOKUP(D219,DATA!$B$27:$N$50,7,FALSE),VLOOKUP(D219,DATA!$B$27:$N$50,8,FALSE),VLOOKUP(D219,DATA!$B$27:$N$50,9,FALSE),VLOOKUP(D219,DATA!$B$27:$N$50,10,FALSE),VLOOKUP(D219,DATA!$B$27:$N$50,11,FALSE),VLOOKUP(D219,DATA!$B$27:$N$50,12,FALSE),VLOOKUP(D219,DATA!$B$27:$N$50,13,FALSE),\"\")*(IF(F220=1,1,0))","v":0},{"$f":"CHOOSE(H219,VLOOKUP(D219,DATA!$B$52:$N$75,2,FALSE),VLOOKUP(D219,DATA!$B$52:$N$75,3,FALSE),VLOOKUP(D219,DATA!$B$52:$N$75,4,FALSE),VLOOKUP(D219,DATA!$B$52:$N$77,5,FALSE),VLOOKUP(D219,DATA!$B$52:$N$75,6,FALSE),VLOOKUP(D219,DATA!$B$52:$N$75,7,FALSE),VLOOKUP(D219,DATA!$B$52:$N$75,8,FALSE),VLOOKUP(D219,DATA!$B$52:$N$75,9,FALSE),VLOOKUP(D219,DATA!$B$52:$N$75,10,FALSE),VLOOKUP(D219,DATA!$B$52:$N$75,11,FALSE),VLOOKUP(D219,DATA!$B$52:$N$75,12,FALSE),VLOOKUP(D219,DATA!$B$52:$N$75,13,FALSE),\"\")*(IF(F221=1,1,0))","v":0},{"$f":"CHOOSE(H219,VLOOKUP(D219,DATA!$B$77:$N$100,2,FALSE),VLOOKUP(D219,DATA!$B$77:$N$100,3,FALSE),VLOOKUP(D219,DATA!$B$77:$N$100,4,FALSE),VLOOKUP(D219,DATA!$B$77:$N$100,5,FALSE),VLOOKUP(D219,DATA!$B$77:$N$100,6,FALSE),VLOOKUP(D219,DATA!$B$77:$N$100,7,FALSE),VLOOKUP(D219,DATA!$B$77:$N$100,8,FALSE),VLOOKUP(D219,DATA!$B$77:$N$100,9,FALSE),VLOOKUP(D219,DATA!$B$77:$N$100,10,FALSE),VLOOKUP(D219,DATA!$B$77:$N$100,11,FALSE),VLOOKUP(D219,DATA!$B$77:$N$100,12,FALSE),VLOOKUP(D219,DATA!$B$77:$N$100,13,FALSE),\"\")*(IF(F222=1,1,0))","v":0},{"$f":"CHOOSE(H219,VLOOKUP(D219,DATA!$B$102:$N$125,2,FALSE),VLOOKUP(D219,DATA!$B$102:$N$125,3,FALSE),VLOOKUP(D219,DATA!$B$102:$N$125,4,FALSE),VLOOKUP(D219,DATA!$B$102:$N$125,5,FALSE),VLOOKUP(D219,DATA!$B$102:$N$125,6,FALSE),VLOOKUP(D219,DATA!$B$102:$N$125,7,FALSE),VLOOKUP(D219,DATA!$B$102:$N$125,8,FALSE),VLOOKUP(D219,DATA!$B$102:$N$125,9,FALSE),VLOOKUP(D219,DATA!$B$102:$N$125,10,FALSE),VLOOKUP(D219,DATA!$B$102:$N$125,11,FALSE),VLOOKUP(D219,DATA!$B$102:$N$125,12,FALSE),VLOOKUP(D219,DATA!$B$102:$N$125,13,FALSE),\"\")*(IF(F222=1,1,0))","v":0},{"$f":"利用申込書2!AG54","v":""}]
[null,{"$f":"TEXT(B219,\"YYYY\")","v":"1900"},null,null,"チェック2",{"$f":"IF(F219=1,1,IF(G220,1,2))","v":2},false,null,null,{"$f":"B222&$J$6","v":"0A"},{"$f":"B222&$K$6","v":"0P"},{"$f":"B222&$L$6","v":"0N"}]
[null,{"$f":"TEXT(B219,\"YYYYmm\")","v":"190001"},null,null,"チェック3",2,false,null,null,{"$f":"G220","v":false},{"$f":"G221","v":false},{"$f":"G222","v":false}]
[null,{"$f":"TEXT(B219,\"d\")","v":"0"},null,null,"チェック4",2,false]
[]
[]
[]
["午前","9:00-12:00"]
["午前-午後","9:00-17:00"]
["午後","13:00-17:00"]
["午後-夜間","13:00-21:00"]
["夜間","18:00-21:00"]
["午前-午後-夜間","9:00-21:00"]
["午前・夜間","9:00・21:00"]
[]
[]
["午前","8:00-12:00"]
["午前-午後","8:00-17:00"]
["午前-午後-夜間","8:00-21:00"]
["午前・夜間","8:00・21:00"]

{"sheet":"請求書ひな形","index":11,"n_rows":48,"n_cols":28,"rows_kept":48,"cut":false,"hidden":true,"merged":[[39,4,39,5],[39,7,39,8],[39,9,39,13],[40,4,40,5],[40,7,40,8],[40,9,40,13],[37,4,37,5],[37,7,37,8],[37,9,37,13],[38,4,38,5],[38,7,38,8],[38,9,38,13],[2,26,2,27],[47,6,47,13],[41,7,41,8],[41,9,41,13],[42,7,42,8],[42,9,42,13],[43,8,43,11],[45,7,45,13],[46,7,46,13],[35,7,35,8],[35,9,35,13],[31,9,31,13],[27,9,27,13],[36,4,36,5],[36,7,36,8],[36,9,36,13],[33,4,33,5],[33,7,33,8],[33,9,33,13],[34,4,34,5],[34,7,34,8],[34,9,34,13],[35,4,35,5],[32,4,32,5],[32,7,32,8],[32,9,32,13],[29,4,29,5],[29,7,29,8],[29,9,29,13],[30,7,30,8],[30,9,30,13],[30,4,30,5],[28,4,28,5],[28,7,28,8],[28,9,28,13],[25,0,25,1],[25,4,25,5],[25,7,25,8],[25,9,25,13],[26,0,26,1],[26,4,26,5],[26,7,26,8],[26,9,26,13],[0,0,0,13],[1,0,1,2],[2,9,2,13],[3,1,3,2],[3,8,3,9],[3,10,3,13],[15,0,15,1],[15,4,15,5],[15,7,15,8],[15,9,15,13],[8,0,8,1],[8,7,8,13],[9,3,9,4],[13,9,13,13],[9,7,11,13],[10,0,10,1],[11,0,11,1],[13,0,13,1],[1,10,1,13],[1,8,1,9],[4,8,5,9],[4,10,5,13],[13,3,13,5],[31,0,31,1],[6,0,6,1],[6,2,6,3],[16,4,16,5],[16,7,16,8],[18,0,18,1],[18,4,18,5],[18,7,18,8],[23,0,23,1],[23,4,23,5],[23,7,23,8],[27,0,27,1],[27,4,27,5],[27,7,27,8],[31,4,31,5],[31,7,31,8],[24,0,24,1],[24,4,24,5],[24,7,24,8],[21,0,21,1],[21,4,21,5],[21,7,21,8],[22,0,22,1],[28,0,28,1],[42,0,42,1],[16,9,16,13],[19,0,19,1],[19,4,19,5],[19,7,19,8],[19,9,19,13],[20,0,20,1],[20,4,20,5],[20,7,20,8],[20,9,20,13],[17,4,17,5],[17,7,17,8],[17,9,17,13],[18,9,18,13],[39,0,39,1],[40,0,40,1],[41,0,41,1],[41,4,41,5],[23,9,23,13],[24,9,24,13],[21,9,21,13],[22,4,22,5],[22,7,22,8],[22,9,22,13]]}
[]
["     請 求 書     Invoice",null,null,null,null,null,null,null,null,null,"Piazza-omi",null,null,null,null,null,"請求書N0.","発効日","顧客名","利用料合計","付帯利用料","その他","合計","支払予定日","支払日"]
[null,null,null,null,null,null,null,null,null,null,null,null,null,null,null,null,{"$f":"K4","v":0},{"$f":"I7","v":"00:00:00"},{"$f":"B4","v":"0"},{"$f":"H42","v":0},null,null,{"$f":"SUM(T3:V3)","v":0},{"$f":"I44","v":{"$error":"#NUM!"}},null,null,"請求書転送"]
[null,{"$f":"利用申込書1!AV10","v":"0"},null,"御中",null,null,null,null,"請求書No."]
[null,null,null,null,null,null,null,null,"登録番号",null,"T8010001092202"]
[]
["催事名：",null,{"$f":"利用申込書1!F21","v":0},null,null,null,null,null,null,"年",null,"月",null,"日",null,null,{"$f":"利用申込書1!AV50","v":""},{"$f":"利用申込書1!A27","v":"00:00:00"}," ",{"$f":"T9&Q7","v":"1月0日"}]
[null,null,null,null,null,null,null,null,null,null,null,null,null,null,null,null,{"$f":"T7","v":"1月0日"}]
["開催日：",null,{"$f":"利用申込書1!A27","v":"00:00:00"},null,null,null,null,"  ピアザ淡海 滋賀県立県民交流センター",null,null,null,null,null,null,null,null,null,{"$f":"MONTH(R7)","v":1},"月",{"$f":"R9&S9&R10&S10","v":"1月0日"}]
[null,null,null,null,null,null,null,"　指定管理者\n　株式会社 コンベンションリンケージ　　　　\n 　　　\n   \n  〒520-0801 滋賀県大津市におの浜一丁目1番20号\n  TEL： 077-527-3315　　FAX： 077-527-3319\n    \n   ",null,null,null,null,null,null,null,null,null,{"$f":"DAY(R7)","v":0},"日"]
["料金区分",null,{"$f":"PG!F2","v":"県内料金"},null,null,null,null,null,null,null,null,null,null,null,null,null,{"$f":"TODAY()","v":45389},{"$f":"YEAR(Q11)","v":2024},"年",null,null,null,null,null,null,null,null,"IF('利用申込書 1'!F27=0, \"\",IF(OR('利用申込書 1'!F27=\"201\", \"201会議室\" "]
["参加費加算\n(ﾋﾟｱｻﾞﾎｰﾙ、大会議室)",null,{"$f":"PG!G2","v":"なし"},null,null,null,null,null,null,null,null,null,null,null,null,null,null,{"$f":"MONTH(Q11)","v":4},"月請求書"]
[null,"下記の通りご請求申しあげます",null,null,null,null,null,null,null,null,null,null,null,null,null,null,{"$f":"R11&S11&R12&S12","v":"2024年4月請求書"}]
["　御請求金額　  \\",null,{"$f":"H43","v":0},null,null,null,null,null,null,null,null,null,null,null,null," "]
[]
["日付\nDate",null,"項　目\nItem","午　前\nMorninng","午　後\nAfternoon",null,"夜　間\nNight","金　額\nAmount",null,"備　考\nRemarks"]
[]
[null,null,"【 施設利用料 】"]
[{"$f":"利用申込書1!A27","v":"00:00:00"},null,{"$f":"利用申込書1!F27","v":0},{"$f":"IF((SUM(利用申込書1!M27:R27)=0),\"\",(SUM(利用申込書1!M27:R27)))","v":""},{"$f":"利用申込書1!W27","v":""},null,{"$f":"利用申込書1!AB27","v":""},{"$f":"IF(SUM(D19:G19)=0,\"\",SUM(D19:G19))","v":""},null,{"$f":"IF(PG!F7=1,\"8時開室料金含む\",\"\")","v":""}]
[{"$f":"IF(利用申込書1!A29=\"\",\"\",利用申込書1!A29)","v":""},null,{"$f":"IF(利用申込書1!F29=0,\"\",利用申込書1!F29)","v":""},{"$f":"IF((SUM(利用申込書1!M29:R29)=0),\"\",(SUM(利用申込書1!M29:R29)))","v":""},{"$f":"利用申込書1!W29","v":""},null,{"$f":"利用申込書1!AB29","v":""},"",null,{"$f":"IF(PG!F11=1,\"8時開室料金含む\",\"\")","v":""}]
[{"$f":"IF(利用申込書1!A31=\"\",\"\",利用申込書1!A31)","v":""},null,{"$f":"IF(利用申込書1!F31=0,\"\",利用申込書1!F31)","v":""},{"$f":"IF((SUM(利用申込書1!M31:R31)=0),\"\",(SUM(利用申込書1!M31:R31)))","v":""},{"$f":"利用申込書1!W31","v":""},null,{"$f":"利用申込書1!AB31","v":""},"",null,{"$f":"IF(PG!F15=1,\"8時開室料金含む\",\"\")","v":""}]
[{"$f":"IF(利用申込書1!A33=\"\",\"\",利用申込書1!A33)","v":""},null,{"$f":"IF(利用申込書1!F33=0,\"\",利用申込書1!F33)","v":""},{"$f":"IF((SUM(利用申込書1!M33:R33)=0),\"\",(SUM(利用申込書1!M33:R33)))","v":""},{"$f":"利用申込書1!W33","v":""},null,{"$f":"利用申込書1!AB33","v":""},"",null,{"$f":"IF(PG!F19=1,\"8時開室料金含む\",\"\")","v":""}]
[{"$f":"IF(利用申込書1!A35=\"\",\"\",利用申込書1!A35)","v":""},null,{"$f":"IF(利用申込書1!F35=0,\"\",利用申込書1!F35)","v":""},{"$f":"IF((SUM(利用申込書1!M35:R35)=0),\"\",(SUM(利用申込書1!M35:R35)))","v":""},{"$f":"利用申込書1!W35","v":""},null,{"$f":"利用申込書1!AB35","v":""},"",null,{"$f":"IF(PG!F23=1,\"8時開室料金含む\",\"\")","v":""}]
[{"$f":"IF(利用申込書1!A37=\"\",\"\",利用申込書1!A37)","v":""},null,{"$f":"IF(利用申込書1!F37=0,\"\",利用申込書1!F37)","v":""},{"$f":"IF((SUM(利用申込書1!M37:R37)=0),\"\",(SUM(利用申込書1!M37:R37)))","v":""},{"$f":"利用申込書1!W37","v":""},null,{"$f":"利用申込書1!AB37","v":""},"",null,{"$f":"IF(PG!F27=1,\"8時開室料金含む\",\"\")","v":""}]
[{"$f":"IF(利用申込書1!A39=\"\",\"\",利用申込書1!A39)","v":""},null,{"$f":"IF(利用申込書1!F39=0,\"\",利用申込書1!F39)","v":""},{"$f":"IF((SUM(利用申込書1!M39:R39)=0),\"\",(SUM(利用申込書1!M39:R39)))","v":""},{"$f":"利用申込書1!W39","v":""},null,{"$f":"利用申込書1!AB39","v":""},"",null,{"$f":"IF(PG!F31=1,\"8時開室料金含む\",\"\")","v":""}]
[{"$f":"IF(利用申込書1!A41=\"\",\"\",利用申込書1!A41)","v":""},null,{"$f":"IF(利用申込書1!F41=0,\"\",利用申込書1!F41)","v":""},{"$f":"IF((SUM(利用申込書1!M41:R41)=0),\"\",(SUM(利用申込書1!M41:R41)))","v":""},{"$f":"利用申込書1!W41","v":""},null,{"$f":"利用申込書1!AB41","v":""},"",null,{"$f":"IF(PG!F35=1,\"8時開室料金含む\",\"\")","v":""}]
[null,null,null,null,null,null,null,null,null,"施設利用料小計"]
[null,null,null,null,null,null,null,null,null,{"$f":"SUM(H19:I26)","v":0}]
["日付",null,"項　目\nItem","単　価\nUnit Price","数　量\nQuantity",null,"区　分\nDivision","金　額\nAmount",null,"備　考\nRemarks"]
[]
[null,null,"【 付帯設備利用料 】"]
[{"$f":"利用申込書1!A27","v":"00:00:00"},null,null,null,null,null,null,{"$f":"IF(SUM(D32:G32)=0,\"\",(D32*E32*G32))","v":""}]
[null,null,null,10,null,null,null,0]
[null,null,null,null,null,null,null,""]
[null,null,null,null,null,null,null,""]
[null,null,null,null,null,null,null,""]
[null,null,null,null,null,null,null,""]
[null,null,null,null,null,null,null,null,null,"付帯設備利用料小計"]
[null,null,null,null,null,null,null,null,null,{"$f":"SUM(H31:I37)","v":0}]
["小 　 計　 (税込)",null,"Sub Total",null,null,null,null,{"$f":"SUM(H19:I37)","v":0}]
["小 　 計　 (税抜)",null,"Sub Total",null,null,null,null,{"$f":"H40-H42","v":0}]
["消 費 税　(10%)",null,"Consumption Tax",null,"（内税）",null,null,{"$f":"ROUNDDOWN(H40/110*10,0)","v":0}]
["合 　 計",null,"Grand Total",null,null,"\\",null,{"$f":"H40","v":0}]
[null,null,null,null,null,null,"お支払期日",null,{"$f":"WORKDAY(利用申込書1!A27,-3,DATA!Q3:T23)","v":{"$error":"#NUM!"}}]
[]
[null,null,null,null,null,null,"振込先：","株式会社 コンベンションリンケージ\n三菱ＵＦＪ銀行 六本木支店　（普）0442241"]
[null,null,null,null,null,null,"振込先：","株式会社 コンベンションリンケージ\n滋賀銀行 膳所駅前支店　（普）586293"]
[null,null,null,null,null,null,"振込手数料は貴社負担でお願いいたします。\n付帯設備は当日に追加・変更となる場合があります。"]

{"sheet":"見積書ひな形","index":12,"n_rows":45,"n_cols":27,"rows_kept":45,"cut":false,"hidden":true,"merged":[[2,26,2,27],[3,1,3,2],[3,8,3,9],[3,10,3,13],[6,0,6,1],[6,2,6,3],[4,8,5,9],[4,10,5,13],[0,0,0,13],[1,0,1,2],[2,9,2,13],[1,10,1,13],[1,6,1,9],[7,2,8,3],[8,0,8,1],[8,7,8,13],[9,3,9,4],[9,7,11,13],[10,0,10,1],[11,0,11,1],[13,3,13,5],[13,0,13,1],[16,4,16,5],[16,7,16,8],[16,9,16,13],[17,4,17,5],[17,7,17,8],[17,9,17,13],[13,9,13,13],[15,0,15,1],[15,4,15,5],[15,7,15,8],[15,9,15,13],[20,0,20,1],[20,4,20,5],[20,7,20,8],[20,9,20,13],[21,0,21,1],[21,4,21,5],[21,7,21,8],[21,9,21,13],[18,0,18,1],[18,4,18,5],[18,7,18,8],[18,9,18,13],[19,0,19,1],[19,4,19,5],[19,7,19,8],[19,9,19,13],[24,0,24,1],[24,4,24,5],[24,7,24,8],[24,9,24,13],[25,0,25,1],[25,4,25,5],[25,7,25,8],[25,9,25,13],[22,0,22,1],[22,4,22,5],[22,7,22,8],[22,9,22,13],[23,0,23,1],[23,4,23,5],[23,7,23,8],[23,9,23,13],[28,0,28,1],[28,4,28,5],[28,7,28,8],[28,9,28,13],[29,4,29,5],[29,7,29,8],[29,9,29,13],[26,0,26,1],[26,4,26,5],[26,7,26,8],[26,9,26,13],[27,0,27,1],[27,4,27,5],[27,7,27,8],[27,9,27,13],[36,4,36,5],[36,7,36,8],[36,9,36,13],[37,4,37,5],[37,7,37,8],[30,4,30,5],[30,7,30,8],[30,9,30,13],[31,0,31,1],[31,4,31,5],[31,7,31,8],[31,9,31,13],[34,4,34,5],[34,7,34,8],[34,9,34,13],[35,4,35,5],[35,7,35,8],[35,9,35,13],[32,4,32,5],[32,7,32,8],[32,9,32,13],[33,4,33,5],[33,7,33,8],[33,9,33,13],[37,9,37,13],[42,0,42,1],[44,6,44,13],[42,7,42,8],[42,9,42,13],[40,4,40,5],[40,7,40,8],[40,9,40,13],[41,7,41,8],[41,9,41,13],[41,4,41,5],[40,0,40,1],[41,0,41,1],[39,0,39,1],[38,4,38,5],[38,7,38,8],[38,9,38,13],[39,4,39,5],[39,7,39,8],[39,9,39,13]]}
[]
["     見　積　書     Estimate",null,null,null,null,null,null,null,null,null,"Piazza-omi",null,null,null,null,null,"請求書N0.","発効日","顧客名","利用料合計","付帯利用料","その他","合計","支払予定日","支払日"]
[null,null,null,null,null,null,null,null,null,null,null,null,null,null,null,null,{"$f":"K4","v":0},{"$f":"I7","v":"00:00:00"},{"$f":"B4","v":"0"},{"$f":"H42","v":0},null,null,{"$f":"SUM(T3:V3)","v":0},{"$f":"#REF!","v":{"$error":"#REF!"}},null,null,"見積書転送"]
[null,{"$f":"利用申込書1!AV10","v":"0"},null,"御中",null,null,null,null,"請求書No."]
[null,null,null,null,null,null,null,null,"登録番号",null,"T8010001092202"]
[]
["催事名：",null,{"$f":"利用申込書1!F21","v":0},null,null,null,null,null,null,"年",null,"月",null,"日",null,null,{"$f":"利用申込書1!AV50","v":""},{"$f":"利用申込書1!A27","v":"00:00:00"}," ",{"$f":"T9&Q7","v":"1月0日"}]
[null,null,{"$f":"利用申込書1!A27","v":"00:00:00"},null,null,null,null,null,null,null,null,null,null,null,null,null,{"$f":"T7","v":"1月0日"}]
["開催日：",null,null,null,null,null,null,"  ピアザ淡海 滋賀県立県民交流センター",null,null,null,null,null,null,null,null,null,{"$f":"MONTH(R7)","v":1},"月",{"$f":"R9&S9&R10&S10","v":"1月0日"}]
[null,null,null,null,null,null,null,"   指定管理者\n   株式会社 コンベンションリンケージ　　　　\n　　　　　　　館　長　　      津　藤　忠　雄\n   \n　 〒520-0801 滋賀県大津市におの浜一丁目1番20号\n　  TEL： 077-527-3315　　FAX： 077-527-3319\n    \n   ",null,null,null,null,null,null,null,null,null,{"$f":"DAY(R7)","v":0},"日"]
["料金区分",null,{"$f":"PG!F2","v":"県内料金"},null,null,null,null,null,null,null,null,null,null,null,null,null,{"$f":"TODAY()","v":45389},{"$f":"YEAR(Q11)","v":2024},"年"]
["参加費加算\n(ﾋﾟｱｻﾞﾎｰﾙ、大会議室)",null,{"$f":"PG!G2","v":"なし"},null,null,null,null,null,null,null,null,null,null,null,null,null,{"$f":"EDATE(Q11,-3)","v":45298},{"$f":"MONTH(Q11)","v":4},"見積書"]
[null,"下記の通りお見積申しあげます",null,null,null,null,null,null,null,null,null,null,null,null,null,null,{"$f":"R11&S11&R12&S12","v":"2024年4見積書"}]
[" 御見積金額　  \\",null,{"$f":"H43","v":0},null,null,null,null,null,null,null,null,null,null,null,null," "]
[]
["日付\nDate",null,"項　目\nItem","午　前\nMorninng","午　後\nAfternoon",null,"夜　間\nNight","金　額\nAmount",null,"備　考\nRemarks"]
[]
[null,null,"【 施設利用料 】"]
[{"$f":"利用申込書1!A27","v":"00:00:00"},null,{"$f":"利用申込書1!F27","v":0},{"$f":"IF((SUM(利用申込書1!M27:R27)=0),\"\",(SUM(利用申込書1!M27:R27)))","v":""},{"$f":"利用申込書1!W27","v":""},null,{"$f":"利用申込書1!AB27","v":""},{"$f":"IF(SUM(D19:G19)=0,\"\",SUM(D19:G19))","v":""},null,{"$f":"IF(PG!F7=1,\"8時開室料金含む\",\"\")","v":""}]
[{"$f":"IF(利用申込書1!A29=\"\",\"\",利用申込書1!A29)","v":""},null,{"$f":"IF(利用申込書1!F29=0,\"\",利用申込書1!F29)","v":""},{"$f":"IF((SUM(利用申込書1!M29:R29)=0),\"\",(SUM(利用申込書1!M29:R29)))","v":""},{"$f":"利用申込書1!W29","v":""},null,{"$f":"利用申込書1!AB29","v":""},"",null,{"$f":"IF(PG!F11=1,\"8時開室料金含む\",\"\")","v":""}]
[{"$f":"IF(利用申込書1!A31=\"\",\"\",利用申込書1!A31)","v":""},null,{"$f":"IF(利用申込書1!F31=0,\"\",利用申込書1!F31)","v":""},{"$f":"IF((SUM(利用申込書1!M31:R31)=0),\"\",(SUM(利用申込書1!M31:R31)))","v":""},{"$f":"利用申込書1!W31","v":""},null,{"$f":"利用申込書1!AB31","v":""},"",null,{"$f":"IF(PG!F15=1,\"8時開室料金含む\",\"\")","v":""}]
[{"$f":"IF(利用申込書1!A33=\"\",\"\",利用申込書1!A33)","v":""},null,{"$f":"IF(利用申込書1!F33=0,\"\",利用申込書1!F33)","v":""},{"$f":"IF((SUM(利用申込書1!M33:R33)=0),\"\",(SUM(利用申込書1!M33:R33)))","v":""},{"$f":"利用申込書1!W33","v":""},null,{"$f":"利用申込書1!AB33","v":""},"",null,{"$f":"IF(PG!F19=1,\"8時開室料金含む\",\"\")","v":""}]
[{"$f":"IF(利用申込書1!A35=\"\",\"\",利用申込書1!A35)","v":""},null,{"$f":"IF(利用申込書1!F35=0,\"\",利用申込書1!F35)","v":""},{"$f":"IF((SUM(利用申込書1!M35:R35)=0),\"\",(SUM(利用申込書1!M35:R35)))","v":""},{"$f":"利用申込書1!W35","v":""},null,{"$f":"利用申込書1!AB35","v":""},"",null,{"$f":"IF(PG!F23=1,\"8時開室料金含む\",\"\")","v":""}]
[{"$f":"IF(利用申込書1!A37=\"\",\"\",利用申込書1!A37)","v":""},null,{"$f":"IF(利用申込書1!F37=0,\"\",利用申込書1!F37)","v":""},{"$f":"IF((SUM(利用申込書1!M37:R37)=0),\"\",(SUM(利用申込書1!M37:R37)))","v":""},{"$f":"利用申込書1!W37","v":""},null,{"$f":"利用申込書1!AB37","v":""},"",null,{"$f":"IF(PG!F27=1,\"8時開室料金含む\",\"\")","v":""}]
[{"$f":"IF(利用申込書1!A39=\"\",\"\",利用申込書1!A39)","v":""},null,{"$f":"IF(利用申込書1!F39=0,\"\",利用申込書1!F39)","v":""},{"$f":"IF((SUM(利用申込書1!M39:R39)=0),\"\",(SUM(利用申込書1!M39:R39)))","v":""},{"$f":"利用申込書1!W39","v":""},null,{"$f":"利用申込書1!AB39","v":""},"",null,{"$f":"IF(PG!F31=1,\"8時開室料金含む\",\"\")","v":""}]
[{"$f":"IF(利用申込書1!A41=\"\",\"\",利用申込書1!A41)","v":""},null,{"$f":"IF(利用申込書1!F41=0,\"\",利用申込書1!F41)","v":""},{"$f":"IF((SUM(利用申込書1!M41:R41)=0),\"\",(SUM(利用申込書1!M41:R41)))","v":""},{"$f":"利用申込書1!W41","v":""},null,{"$f":"利用申込書1!AB41","v":""},"",null,{"$f":"IF(PG!F35=1,\"8時開室料金含む\",\"\")","v":""}]
[null,null,null,null,null,null,null,null,null,"施設利用料小計"]
[null,null,null,null,null,null,null,null,null,{"$f":"SUM(H19:I26)","v":0}]
["日付",null,"項　目\nItem","単　価\nUnit Price","数　量\nQuantity",null,"区　分\nDivision","金　額\nAmount",null,"備　考\nRemarks"]
[]
[null,null,"【 付帯設備利用料 】"]
[{"$f":"利用申込書1!A27","v":"00:00:00"}]
[null,null,null,null,null,null,null,{"$f":"D33*E33*G33","v":0}]
[null,null,null,null,null,null,null,{"$f":"D34*E34*G34","v":0}]
[null,null,null,null,null,null,null,{"$f":"D35*E35*G35","v":0}]
[null,null,null,null,null,null,null,{"$f":"D36*E36*G36","v":0}]
[null,null,null,null,null,null,null,{"$f":"D37*E37*G37","v":0}]
[null,null,null,null,null,null,null,null,null,"付帯設備利用料小計"]
[null,null,null,null,null,null,null,null,null,{"$f":"SUM(H31:I37)","v":0}]
["小 　 計　 (税込)",null,"Sub Total",null,null,null,null,{"$f":"SUM(H19:I37)","v":0}]
["小 　 計　 (税抜)",null,"Sub Total",null,null,null,null,{"$f":"H40-H42","v":0}]
["消 費 税　(10%)",null,"Consumption Tax",null,"（内税）",null,null,{"$f":"ROUNDDOWN(H40/110*10,0)","v":0}]
["合 　 計",null,"Grand Total",null,null,"\\",null,{"$f":"H40","v":0}]
[]
[null,null,null,null,null,null,"振込手数料は貴社負担でお願いいたします。\n"]

{"sheet":"Sheet5","index":13,"n_rows":0,"n_cols":0,"rows_kept":0,"cut":false,"hidden":true,"merged":[]}